id_mutation,date_mutation,numero_disposition,nature_mutation,valeur_fonciere,adresse_numero,adresse_suffixe,adresse_nom_voie,adresse_code_voie,code_postal,code_commune,nom_commune,code_departement,ancien_code_commune,ancien_nom_commune,id_parcelle,ancien_id_parcelle,numero_volume,lot1_numero,lot1_surface_carrez,lot2_numero,lot2_surface_carrez,lot3_numero,lot3_surface_carrez,lot4_numero,lot4_surface_carrez,lot5_numero,lot5_surface_carrez,nombre_lots,code_type_local,type_local,surface_reelle_bati,nombre_pieces_principales,code_nature_culture,nature_culture,code_nature_culture_speciale,nature_culture_speciale,surface_terrain,longitude,latitude
2020-678824,2020-01-07,000001,Vente,85000,3,,ALL DES FOURQUEYRIES,0126,46220,46225,Prayssac,46,,,46225000AD0194,,,,,,,,,,,,,0,,,,,AB,terrains a bâtir,,,1143,1.186366,44.509308
2020-678824,2020-01-07,000001,Vente,85000,5,,ALL DES FOURQUEYRIES,0126,46220,46225,Prayssac,46,,,46225000AD0195,,,,,,,,,,,,,0,,,,,AB,terrains a bâtir,,,1143,1.186861,44.509136
2020-678855,2020-01-17,000001,Vente,800,,,LA RIVIERE DE NIAUDON,B186,46220,46225,Prayssac,46,,,462250000B0920,,,,,,,,,,,,,0,,,,,P,prés,,,1355,1.204829,44.528747
2020-678855,2020-01-17,000001,Vente,800,,,LA RIVIERE DE NIAUDON,B186,46220,46225,Prayssac,46,,,462250000B0941,,,,,,,,,,,,,0,,,,,BT,taillis simples,,,397,1.20439,44.528695
2020-678855,2020-01-17,000001,Vente,800,,,LA RIVIERE DE NIAUDON,B186,46220,46225,Prayssac,46,,,462250000B0941,,,,,,,,,,,,,0,,,,,T,terres,,,437,1.20439,44.528695
2020-678855,2020-01-17,000001,Vente,800,,,LA RIVIERE DE NIAUDON,B186,46220,46225,Prayssac,46,,,462250000B0941,,,,,,,,,,,,,0,,,,,T,terres,,,1231,1.20439,44.528695
2020-678855,2020-01-17,000001,Vente,800,,,LA RIVIERE DE NIAUDON,B186,46220,46225,Prayssac,46,,,462250000B0942,,,,,,,,,,,,,0,,,,,L,landes,,,2540,1.203677,44.528927
2020-678855,2020-01-17,000001,Vente,800,,,LA RIVIERE DE NIAUDON,B186,46220,46225,Prayssac,46,,,462250000B0943,,,,,,,,,,,,,0,,,,,BT,taillis simples,,,740,1.203014,44.529047
2020-678976,2020-01-22,000001,Vente,45000,44,,AV DU LOT,0128,46220,46225,Prayssac,46,,,462250000E3050,,,,,,,,,,,,,0,,,,,T,terres,,,4490,1.163078,44.508151
2020-679019,2020-01-25,000001,Vente,28695,3,,ALL DES RESCALOUS,0097,46220,46225,Prayssac,46,,,46225000AE0198,,,,,,,,,,,,,0,,,,,AB,terrains a bâtir,,,835,1.191179,44.511611
2020-679107,2020-01-27,000001,Vente,400000,,,CALVAYRAC,B032,46220,46225,Prayssac,46,,,462250000E0319,,,,,,,,,,,,,0,,,,,BS,taillis sous futaie,,,4135,1.168207,44.512514
2020-679107,2020-01-27,000001,Vente,400000,,,CALVAYRAC,B032,46220,46225,Prayssac,46,,,462250000E0320,,,,,,,,,,,,,0,,,,,BS,taillis sous futaie,,,585,1.167916,44.512646
2020-679107,2020-01-27,000001,Vente,400000,,,CALVAYRAC,B032,46220,46225,Prayssac,46,,,462250000E0334,,,,,,,,,,,,,0,,,,,L,landes,,,9040,1.170036,44.509767
2020-679107,2020-01-27,000001,Vente,400000,,,CALVAYRAC,B032,46220,46225,Prayssac,46,,,462250000E0335,,,,,,,,,,,,,0,,,,,BS,taillis sous futaie,,,2285,1.16976,44.510016
2020-679107,2020-01-27,000001,Vente,400000,,,CALVAYRAC,B032,46220,46225,Prayssac,46,,,462250000E0336,,,,,,,,,,,,,0,,,,,L,landes,,,3650,1.16963,44.510814
2020-679107,2020-01-27,000001,Vente,400000,46,,RTE DE CALVAYRAC,0026,46220,46225,Prayssac,46,,,462250000E0337,,,,,,,,,,,,,0,1,Maison,354,9,S,sols,,,2800,1.169789,44.511326
2020-679107,2020-01-27,000001,Vente,400000,,,CALVAYRAC,B032,46220,46225,Prayssac,46,,,462250000E0338,,,,,,,,,,,,,0,,,,,BR,futaies résineuses,PIN,Pins,1800,1.169195,44.511525
2020-679107,2020-01-27,000001,Vente,400000,,,CALVAYRAC,B032,46220,46225,Prayssac,46,,,462250000E0339,,,,,,,,,,,,,0,,,,,BS,taillis sous futaie,,,905,1.16853,44.51192
2020-679107,2020-01-27,000001,Vente,400000,37,,RTE DE CALVAYRAC,0026,46220,46225,Prayssac,46,,,462250000E0340,,,,,,,,,,,,,0,3,Dépendance,,0,T,terres,,,4180,1.169186,44.511948
2020-679107,2020-01-27,000001,Vente,400000,37,,RTE DE CALVAYRAC,0026,46220,46225,Prayssac,46,,,462250000E0340,,,,,,,,,,,,,0,3,Dépendance,,0,S,sols,,,1580,1.169186,44.511948
2020-679107,2020-01-27,000001,Vente,400000,37,,RTE DE CALVAYRAC,0026,46220,46225,Prayssac,46,,,462250000E0340,,,,,,,,,,,,,0,1,Maison,53,2,S,sols,,,1580,1.169186,44.511948
2020-679107,2020-01-27,000001,Vente,400000,37,,RTE DE CALVAYRAC,0026,46220,46225,Prayssac,46,,,462250000E0340,,,,,,,,,,,,,0,1,Maison,53,2,T,terres,,,4180,1.169186,44.511948
2020-679107,2020-01-27,000001,Vente,400000,,,BOUT DE LA COTE,B023,46220,46225,Prayssac,46,,,462250000E0414,,,,,,,,,,,,,0,,,,,L,landes,,,3750,1.166523,44.510185
2020-679107,2020-01-27,000001,Vente,400000,,,BOUT DE LA COTE,B023,46220,46225,Prayssac,46,,,462250000E0435,,,,,,,,,,,,,0,,,,,L,landes,,,1030,1.164129,44.510244
2020-679107,2020-01-27,000001,Vente,400000,,,BOUT DE LA COTE,B023,46220,46225,Prayssac,46,,,462250000E0437,,,,,,,,,,,,,0,,,,,BS,taillis sous futaie,,,3120,1.163679,44.510349
2020-679107,2020-01-27,000001,Vente,400000,,,CALVAYRAC,B032,46220,46225,Prayssac,46,,,462250000E2493,,,,,,,,,,,,,0,,,,,BT,taillis simples,,,32745,1.170853,44.511944
2020-679107,2020-01-27,000001,Vente,400000,,,CALVAYRAC,B032,46220,46225,Prayssac,46,,,462250000E2493,,,,,,,,,,,,,0,,,,,BR,futaies résineuses,PIN,Pins,18796,1.170853,44.511944
2020-679107,2020-01-27,000001,Vente,400000,,,CALVAYRAC,B032,46220,46225,Prayssac,46,,,462250000E2493,,,,,,,,,,,,,0,,,,,T,terres,,,28545,1.170853,44.511944
2020-679107,2020-01-27,000001,Vente,400000,,,CALVAYRAC,B032,46220,46225,Prayssac,46,,,462250000E2494,,,,,,,,,,,,,0,,,,,BR,futaies résineuses,PIN,Pins,945,1.171053,44.510928
2020-679107,2020-01-27,000001,Vente,400000,,,CALVAYRAC,B032,46220,46225,Prayssac,46,,,462250000E2663,,,,,,,,,,,,,0,,,,,BT,taillis simples,,,8342,1.168892,44.511254
2020-679108,2020-01-27,000001,Vente,90000,6,,IMP DES GARABETS,0174,46220,46225,Prayssac,46,,,46225000AA0234,,,,,,,,,,,,,0,1,Maison,89,4,S,sols,,,61,1.187433,44.505019
2020-679201,2020-02-04,000001,Vente,272000,49,,RUE DES NOYERS,0076,46220,46225,Prayssac,46,,,462250000C2068,,,,,,,,,,,,,0,1,Maison,126,4,S,sols,,,2147,1.192495,44.51632
2020-679315,2020-02-06,000002,Vente,105000,10,B,RUE TOULOUSE LAUTREC,0113,46220,46225,Prayssac,46,,,46225000AC0363,,,,,,,,,,,,,0,1,Maison,91,4,,,,,,1.182534,44.504628
2020-679400,2020-02-17,000001,Vente,13000,5,,RUE DES CLEDELLES,0129,46220,46225,Prayssac,46,,,462250000E3198,,,,,,,,,,,,,0,,,,,AB,terrains a bâtir,,,813,1.17131,44.506666
2020-679477,2020-02-27,000001,Vente,206002,5217,F,RUE DES VENDANGEURS,0111,46220,46225,Prayssac,46,,,46225000AD0136,,,,,,,,,,,,,0,1,Maison,120,4,T,terres,,,2117,1.187836,44.511136
2020-679477,2020-02-27,000001,Vente,206002,5217,F,RUE DES VENDANGEURS,0111,46220,46225,Prayssac,46,,,46225000AD0136,,,,,,,,,,,,,0,1,Maison,120,4,S,sols,,,500,1.187836,44.511136
2020-679485,2020-01-31,000001,Vente,425000,32,,RUE DE LA PLAINE,0199,46220,46225,Prayssac,46,,,46225000AC0225,,,,,,,,,,,,,0,4,Local industriel. commercial ou assimilé,90,0,S,sols,,,1018,1.177413,44.505048
2020-679485,2020-01-31,000001,Vente,425000,32,,RUE DE LA PLAINE,0199,46220,46225,Prayssac,46,,,46225000AC0225,,,,,,,,,,,,,0,4,Local industriel. commercial ou assimilé,90,0,S,sols,,,1018,1.177413,44.505048
2020-679485,2020-01-31,000001,Vente,425000,32,,RUE DE LA PLAINE,0199,46220,46225,Prayssac,46,,,46225000AC0225,,,,,,,,,,,,,0,4,Local industriel. commercial ou assimilé,90,0,S,sols,,,1018,1.177413,44.505048
2020-679485,2020-01-31,000001,Vente,425000,32,,RUE DE LA PLAINE,0199,46220,46225,Prayssac,46,,,46225000AC0225,,,,,,,,,,,,,0,4,Local industriel. commercial ou assimilé,90,0,S,sols,,,1018,1.177413,44.505048
2020-679485,2020-01-31,000001,Vente,425000,36,,RUE DE LA PLAINE,0199,46220,46225,Prayssac,46,,,46225000AC0229,,,,,,,,,,,,,0,,,,,S,sols,,,536,1.177214,44.50516
2020-679549,2020-03-12,000001,Vente,29000,4,,ALL DES FOURQUEYRIES,0126,46220,46225,Prayssac,46,,,46225000AD0199,,,,,,,,,,,,,0,1,Maison,80,4,S,sols,,,651,1.186046,44.509037
2020-679573,2020-02-24,000001,Vente,220000,,,COUSTAL DE PESCADOIRES,B060,46220,46225,Prayssac,46,,,462250000E0587,,,,,,,,,,,,,0,,,,,L,landes,,,6325,1.156533,44.508991
2020-679573,2020-02-24,000001,Vente,220000,5347,,COUSTAL DE PESCADOIRES,B060,46220,46225,Prayssac,46,,,462250000E0588,,,,,,,,,,,,,0,1,Maison,180,5,S,sols,,,990,1.155969,44.509096
2020-679573,2020-02-24,000001,Vente,220000,,,COUSTAL DE PESCADOIRES,B060,46220,46225,Prayssac,46,,,462250000E1566,,,,,,,,,,,,,0,,,,,BS,taillis sous futaie,,,905,1.157728,44.508466
2020-679573,2020-02-24,000001,Vente,220000,,,LE LAC,B091,46220,46225,Prayssac,46,,,462250000E2995,,,,,,,,,,,,,0,,,,,T,terres,,,69,1.157411,44.510183
2020-679573,2020-02-24,000001,Vente,220000,,,LE LAC,B091,46220,46225,Prayssac,46,,,462250000E2998,,,,,,,,,,,,,0,,,,,T,terres,,,264,1.158117,44.509894
2020-679573,2020-02-24,000001,Vente,220000,,,COUSTAL DE PESCADOIRES,B060,46220,46225,Prayssac,46,,,462250000E3000,,,,,,,,,,,,,0,,,,,L,landes,,,95,1.156101,44.509545
2020-679573,2020-02-24,000001,Vente,220000,,,COUSTAL DE PESCADOIRES,B060,46220,46225,Prayssac,46,,,462250000E3001,,,,,,,,,,,,,0,,,,,L,landes,,,1405,1.155996,44.509426
2020-679641,2020-02-28,000001,Vente,60000,5485,,BD DE LA PAIX,0080,46220,46225,Prayssac,46,,,46225000AA0386,,,,,,,,,,,,,0,4,Local industriel. commercial ou assimilé,23,0,S,sols,,,42,1.187352,44.504437
2020-679641,2020-02-28,000001,Vente,60000,5485,,BD DE LA PAIX,0080,46220,46225,Prayssac,46,,,46225000AA0386,,,,,,,,,,,,,0,2,Appartement,27,1,S,sols,,,42,1.187352,44.504437
2020-679641,2020-02-28,000001,Vente,60000,5485,,BD DE LA PAIX,0080,46220,46225,Prayssac,46,,,46225000AA0386,,,,,,,,,,,,,0,2,Appartement,27,1,S,sols,,,42,1.187352,44.504437
2020-679649,2020-03-06,000001,Vente,229000,16,,CHEM DES GAULIES,0197,46220,46225,Prayssac,46,,,462250000D0111,,,,,,,,,,,,,0,1,Maison,111,4,S,sols,,,305,1.182157,44.499152
2020-679649,2020-03-06,000001,Vente,229000,,,LE GAL,B069,46220,46225,Prayssac,46,,,462250000D2423,,,,,,,,,,,,,0,,,,,J,jardins,,,159,1.181958,44.499177
2020-679649,2020-03-06,000001,Vente,229000,,,LE GAL,B069,46220,46225,Prayssac,46,,,462250000D2425,,,,,,,,,,,,,0,,,,,J,jardins,,,538,1.182041,44.499032
2020-679784,2020-02-13,000002,Echange,200,,,LES CARIS,B042,46220,46225,Prayssac,46,,,462250000D2559,,,,,,,,,,,,,0,,,,,S,sols,,,421,1.186868,44.482812
2020-679784,2020-02-13,000003,Echange,200,,,LES CARIS,B042,46220,46225,Prayssac,46,,,462250000D2112,,,,,,,,,,,,,0,,,,,VI,vignes,VAOC,Vins d'appellation d'origine contrôlée,660,1.187192,44.483053
2020-679784,2020-02-13,000003,Echange,200,,,LES CARIS,B042,46220,46225,Prayssac,46,,,462250000D2112,,,,,,,,,,,,,0,,,,,J,jardins,,,660,1.187192,44.483053
2020-679797,2020-02-26,000001,Vente,87736,,,LE TINDOUL,B210,46220,46225,Prayssac,46,,,462250000D1293,,,,,,,,,,,,,0,,,,,T,terres,,,668,1.191194,44.475088
2020-679797,2020-02-26,000001,Vente,87736,1173,,RTE DES CAMBOUS,0190,46220,46225,Prayssac,46,,,462250000D1312,,,,,,,,,,,,,0,1,Maison,49,3,S,sols,,,1590,1.1895,44.474289
2020-679805,2020-03-04,000001,Vente,79000,28,,BD GAMBETTA,0040,46220,46225,Prayssac,46,,,46225000AC0168,,,,,,,,,,,,,0,1,Maison,80,5,S,sols,,,637,1.184226,44.502233
2020-679879,2020-03-26,000001,Vente,160000,5288,F,PIECE GRANDE,B162,46220,46225,Prayssac,46,,,462250000D2249,,,,,,,,,,,,,0,1,Maison,88,4,S,sols,,,2049,1.183087,44.49865
2020-679880,2020-03-23,000001,Vente,165000,2185,,RTE DE NIAUDON,0182,46220,46225,Prayssac,46,,,462250000B1190,,,,,,,,,,,,,0,1,Maison,99,4,S,sols,,,1000,1.20525,44.530384
2020-679880,2020-03-23,000001,Vente,165000,2185,,RTE DE NIAUDON,0182,46220,46225,Prayssac,46,,,462250000B1190,,,,,,,,,,,,,0,1,Maison,99,4,AG,terrains d'agrément,,,2712,1.20525,44.530384
2020-679880,2020-03-23,000001,Vente,165000,,,LA RIVIERE DE NIAUDON,B186,46220,46225,Prayssac,46,,,462250000B1192,,,,,,,,,,,,,0,,,,,L,landes,,,4056,1.204551,44.530592
2020-679880,2020-03-23,000001,Vente,165000,,,LA RIVIERE DE NIAUDON,B186,46220,46225,Prayssac,46,,,462250000B1192,,,,,,,,,,,,,0,,,,,S,sols,,,100,1.204551,44.530592
2020-679913,2020-04-22,000001,Vente,133410,14,,AV DES ACACIAS,0004,46220,46225,Prayssac,46,,,46225000AA0045,,,,,,,,,,,,,0,1,Maison,77,4,S,sols,,,569,1.192717,44.50464
2020-679940,2020-04-01,000001,Vente,85000,24,,BD ARISTIDE BRIAND,0005,46220,46225,Prayssac,46,,,46225000AA0276,,,,,,,,,,,,,0,1,Maison,120,4,S,sols,,,236,1.18881,44.505278
2020-679962,2020-05-12,000001,Vente,197700,18,,RUE DES DOLMENS,0024,46220,46225,Prayssac,46,,,462250000C1807,,,,,,,,,,,,,0,1,Maison,111,5,BT,taillis simples,,,2505,1.201645,44.502535
2020-679962,2020-05-12,000001,Vente,197700,18,,RUE DES DOLMENS,0024,46220,46225,Prayssac,46,,,462250000C1807,,,,,,,,,,,,,0,1,Maison,111,5,S,sols,,,500,1.201645,44.502535
2020-680022,2020-04-28,000001,Vente,3225.6,,,PLAINE DE BOUTIER,B165,46220,46225,Prayssac,46,,,462250000D1867,,,,,,,,,,,,,0,,,,,VI,vignes,VAOC,Vins d'appellation d'origine contrôlée,2688,1.186475,44.487417
2020-680038,2020-05-05,000001,Vente,72400,3,,IMP DES TONNELIERS,0104,46220,46225,Prayssac,46,,,46225000AD0064,,,,,,,,,,,,,0,1,Maison,85,4,S,sols,,,570,1.188904,44.510509
2020-680052,2020-05-12,000001,Vente,90000,6,,RUE GEORGES BRASSENS,0046,46220,46225,Prayssac,46,,,46225000AC0064,,,,,,,,,,,,,0,1,Maison,72,3,S,sols,,,531,1.183527,44.505213
2020-680093,2020-05-06,000001,Vente,30000,15,,BD DE LA PAIX,0080,46220,46225,Prayssac,46,,,46225000AA0358,,,,,,,,,,,,,0,1,Maison,20,1,S,sols,,,23,1.188241,44.504512
2020-680093,2020-05-06,000001,Vente,30000,15,,BD DE LA PAIX,0080,46220,46225,Prayssac,46,,,46225000AA0358,,,,,,,,,,,,,0,4,Local industriel. commercial ou assimilé,16,0,S,sols,,,23,1.188241,44.504512
2020-680216,2020-05-19,000001,Vente,75000,31,,BD ARISTIDE BRIAND,0005,46220,46225,Prayssac,46,,,46225000AA0235,,,,,,,,,,,,,0,1,Maison,70,4,S,sols,,,79,1.187546,44.505053
2020-680221,2020-05-25,000001,Vente,90000,15,,BD GAMBETTA,0040,46220,46225,Prayssac,46,,,46225000AC0156,,,,,,,,,,,,,0,3,Dépendance,,0,S,sols,,,546,1.183684,44.502629
2020-680221,2020-05-25,000001,Vente,90000,15,,BD GAMBETTA,0040,46220,46225,Prayssac,46,,,46225000AC0156,,,,,,,,,,,,,0,1,Maison,65,3,S,sols,,,546,1.183684,44.502629
2020-680226,2020-05-23,000001,Vente,100000,24,,BD DE LA PAIX,0080,46220,46225,Prayssac,46,,,46225000AA0228,,,,,,,,,,,,,0,1,Maison,130,4,S,sols,,,82,1.187586,44.504839
2020-680271,2020-05-14,000001,Vente,100000,,,PIECE GRANDE,B162,46220,46225,Prayssac,46,,,462250000D0148,,,,,,,,,,,,,0,,,,,T,terres,,,1250,1.183915,44.500281
2020-680271,2020-05-14,000001,Vente,100000,,,PIECE GRANDE,B162,46220,46225,Prayssac,46,,,462250000D0149,,,,,,,,,,,,,0,,,,,T,terres,,,1175,1.183908,44.500067
2020-680299,2020-05-27,000001,Vente,185000,,,MANISSERRE,B123,46220,46225,Prayssac,46,,,462250000D1188,,,,,,,,,,,,,0,,,,,T,terres,,,3853,1.196638,44.473438
2020-680299,2020-05-27,000001,Vente,185000,,,MANISSERRE,B123,46220,46225,Prayssac,46,,,462250000D1188,,,,,,,,,,,,,0,,,,,VE,vergers,NOYER,Noyeraie ou noyers,1612,1.196638,44.473438
2020-680299,2020-05-27,000001,Vente,185000,,,MANISSERRE,B123,46220,46225,Prayssac,46,,,462250000D1188,,,,,,,,,,,,,0,,,,,P,prés,,,1100,1.196638,44.473438
2020-680299,2020-05-27,000001,Vente,185000,219,,CHEM DE FLOIRAS,0142,46220,46225,Prayssac,46,,,462250000D1189,,,,,,,,,,,,,0,1,Maison,105,4,S,sols,,,1085,1.197073,44.473532
2020-680299,2020-05-27,000001,Vente,185000,,,MANISSERRE,B123,46220,46225,Prayssac,46,,,462250000D1190,,,,,,,,,,,,,0,,,,,P,prés,,,2210,1.197539,44.473331
2020-680338,2020-05-21,000001,Vente,142000,37,,RTE DU THERON,0021,46220,46225,Prayssac,46,,,46225000AD0187,,,,,,,,,,,,,0,1,Maison,108,3,S,sols,,,500,1.182609,44.509469
2020-680338,2020-05-21,000001,Vente,142000,37,,RTE DU THERON,0021,46220,46225,Prayssac,46,,,46225000AD0187,,,,,,,,,,,,,0,1,Maison,108,3,T,terres,,,2053,1.182609,44.509469
2020-680344,2020-04-17,000001,Vente,189010,,,LES CAILLOUX,B031,46220,46225,Prayssac,46,,,462250000E0944,,,,,,,,,,,,,0,,,,,T,terres,,,230,1.181265,44.511493
2020-680344,2020-04-17,000001,Vente,189010,24,,RTE DU THERON,0021,46220,46225,Prayssac,46,,,462250000E0945,,,,,,,,,,,,,0,1,Maison,95,4,S,sols,,,665,1.181598,44.511257
2020-680344,2020-04-17,000001,Vente,189010,24,,RTE DU THERON,0021,46220,46225,Prayssac,46,,,462250000E0945,,,,,,,,,,,,,0,1,Maison,36,2,S,sols,,,665,1.181598,44.511257
2020-680344,2020-04-17,000001,Vente,189010,,,LES CAILLOUX,B031,46220,46225,Prayssac,46,,,462250000E0946,,,,,,,,,,,,,0,,,,,T,terres,,,5385,1.181827,44.511557
2020-680380,2020-06-04,000001,Vente,148650,51,,RUE DE LA REPUBLIQUE,0100,46220,46225,Prayssac,46,,,46225000AD0057,,,,,,,,,,,,,0,1,Maison,78,3,AG,terrains d'agrément,,,1684,1.189095,44.510984
2020-680380,2020-06-04,000001,Vente,148650,51,,RUE DE LA REPUBLIQUE,0100,46220,46225,Prayssac,46,,,46225000AD0057,,,,,,,,,,,,,0,1,Maison,78,3,S,sols,,,500,1.189095,44.510984
2020-680463,2020-05-27,000002,Vente,2494,6,,ALL DES PASSIFLORES,0127,46220,46225,Prayssac,46,,,46225000AC0372,,,,,,,,,,,,,0,,,,,J,jardins,,,86,1.180331,44.502688
2020-680525,2020-05-29,000001,Vente,23489,,,PLAINE DE BOUTIER,B165,46220,46225,Prayssac,46,,,462250000D0901,,,,,,,,,,,,,0,,,,,VI,vignes,VAOC,Vins d'appellation d'origine contrôlée,3125,1.184059,44.487952
2020-680525,2020-05-29,000001,Vente,23489,,,PLAINE DE BOUTIER,B165,46220,46225,Prayssac,46,,,462250000D0924,,,,,,,,,,,,,0,,,,,VI,vignes,VAOC,Vins d'appellation d'origine contrôlée,5435,1.186161,44.487758
2020-680525,2020-05-29,000001,Vente,23489,,,PLAINE DE BOUTIER,B165,46220,46225,Prayssac,46,,,462250000D1435,,,,,,,,,,,,,0,,,,,VI,vignes,VAOC,Vins d'appellation d'origine contrôlée,2993,1.187096,44.487887
2020-680525,2020-05-29,000001,Vente,23489,,,PLAINE DE BOUTIER,B165,46220,46225,Prayssac,46,,,462250000D1608,,,,,,,,,,,,,0,,,,,VI,vignes,,,972,1.184066,44.488224
2020-680525,2020-05-29,000001,Vente,23489,,,PLAINE DE BOUTIER,B165,46220,46225,Prayssac,46,,,462250000D1609,,,,,,,,,,,,,0,,,,,VI,vignes,VAOC,Vins d'appellation d'origine contrôlée,7049,1.185609,44.48797
2020-680532,2020-05-29,000001,Vente,17721.6,,,LES CARIS,B042,46220,46225,Prayssac,46,,,462250000D0580,,,,,,,,,,,,,0,,,,,VI,vignes,VAOC,Vins d'appellation d'origine contrôlée,3705,1.189485,44.48729
2020-680532,2020-05-29,000001,Vente,17721.6,,,LES CARIS,B042,46220,46225,Prayssac,46,,,462250000D1585,,,,,,,,,,,,,0,,,,,VI,vignes,VAOC,Vins d'appellation d'origine contrôlée,7371,1.187348,44.486867
2020-680533,2020-05-28,000001,Vente,350000,5068,A,PECH CHAGUT,B143,46220,46225,Prayssac,46,,,462250000B1115,,,,,,,,,,,,,0,3,Dépendance,,0,S,sols,,,500,1.192737,44.523005
2020-680533,2020-05-28,000001,Vente,350000,5068,A,PECH CHAGUT,B143,46220,46225,Prayssac,46,,,462250000B1115,,,,,,,,,,,,,0,1,Maison,104,3,T,terres,,,4546,1.192737,44.523005
2020-680533,2020-05-28,000001,Vente,350000,5068,A,PECH CHAGUT,B143,46220,46225,Prayssac,46,,,462250000B1115,,,,,,,,,,,,,0,3,Dépendance,,0,T,terres,,,4546,1.192737,44.523005
2020-680533,2020-05-28,000001,Vente,350000,5068,A,PECH CHAGUT,B143,46220,46225,Prayssac,46,,,462250000B1115,,,,,,,,,,,,,0,1,Maison,104,3,S,sols,,,500,1.192737,44.523005
2020-680533,2020-05-28,000001,Vente,350000,5068,A,PECH CHAGUT,B143,46220,46225,Prayssac,46,,,462250000B1115,,,,,,,,,,,,,0,3,Dépendance,,0,S,sols,,,500,1.192737,44.523005
2020-680533,2020-05-28,000001,Vente,350000,5068,A,PECH CHAGUT,B143,46220,46225,Prayssac,46,,,462250000B1115,,,,,,,,,,,,,0,3,Dépendance,,0,T,terres,,,4546,1.192737,44.523005
2020-680612,2020-06-19,000001,Vente,3000,,,DEVEZ,B062,46220,46225,Prayssac,46,,,462250000A0249,,,,,,,,,,,,,0,,,,,BT,taillis simples,,,9480,1.173272,44.538922
2020-680697,2020-06-11,000001,Vente,80000,,,LE TRIOULOU,B219,46220,46225,Prayssac,46,,,462250000E0897,,,,,,,,,,,,,0,,,,,T,terres,,,1280,1.186238,44.514619
2020-680697,2020-06-11,000001,Vente,80000,,,LE TRIOULOU,B219,46220,46225,Prayssac,46,,,462250000E0898,,,,,,,,,,,,,0,,,,,T,terres,,,1270,1.186075,44.514522
2020-680697,2020-06-11,000001,Vente,80000,,,LE TRIOULOU,B219,46220,46225,Prayssac,46,,,462250000E0899,,,,,,,,,,,,,0,,,,,S,sols,,,50,1.185638,44.514522
2020-680697,2020-06-11,000001,Vente,80000,2,B,IMP DU TRIOULOU,0114,46220,46225,Prayssac,46,,,462250000E2110,,,,,,,,,,,,,0,1,Maison,74,2,T,terres,,,684,1.185969,44.51443
2020-680697,2020-06-11,000001,Vente,80000,2,B,IMP DU TRIOULOU,0114,46220,46225,Prayssac,46,,,462250000E2110,,,,,,,,,,,,,0,1,Maison,74,2,S,sols,,,401,1.185969,44.51443
2020-680697,2020-06-11,000001,Vente,80000,,,LE TRIOULOU,B219,46220,46225,Prayssac,46,,,462250000E3082,,,,,,,,,,,,,0,,,,,T,terres,,,472,1.18529,44.513843
2020-680697,2020-06-11,000001,Vente,80000,,,LE TRIOULOU,B219,46220,46225,Prayssac,46,,,462250000E3084,,,,,,,,,,,,,0,,,,,T,terres,,,61,1.185512,44.514453
2020-681149,2020-07-16,000001,Vente,120000,,,TRAVERS DE FANTOU,B212,46220,46225,Prayssac,46,,,462250000D0521,,,,,,,,,,,,,0,,,,,BS,taillis sous futaie,,,1490,1.190864,44.485045
2020-681149,2020-07-16,000001,Vente,120000,,,LES CARIS,B042,46220,46225,Prayssac,46,,,462250000D0574,,,,,,,,,,,,,0,,,,,T,terres,,,4420,1.190521,44.484855
2020-681149,2020-07-16,000001,Vente,120000,,,LES CARIS,B042,46220,46225,Prayssac,46,,,462250000D0577,,,,,,,,,,,,,0,,,,,T,terres,,,1015,1.19003,44.485793
2020-681149,2020-07-16,000001,Vente,120000,100,,CHEM DES NAUZES,0163,46220,46225,Prayssac,46,,,462250000D0589,,,,,,,,,,,,,0,1,Maison,75,3,S,sols,,,550,1.18842,44.488019
2020-681149,2020-07-16,000001,Vente,120000,,,BOUTIER,B024,46220,46225,Prayssac,46,,,462250000D0824,,,,,,,,,,,,,0,,,,,BT,taillis simples,,,1675,1.17994,44.487098
2020-681149,2020-07-16,000001,Vente,120000,,,PLAINE DE BOUTIER,B165,46220,46225,Prayssac,46,,,462250000D0894,,,,,,,,,,,,,0,,,,,T,terres,,,4180,1.185311,44.489243
2020-681149,2020-07-16,000001,Vente,120000,,,LES GRAUZILS,B083,46220,46225,Prayssac,46,,,462250000D1115,,,,,,,,,,,,,0,,,,,VI,vignes,VAOC,Vins d'appellation d'origine contrôlée,776,1.193225,44.480325
2020-681149,2020-07-16,000001,Vente,120000,,,LES GRAUZILS,B083,46220,46225,Prayssac,46,,,462250000D1115,,,,,,,,,,,,,0,,,,,T,terres,,,1939,1.193225,44.480325
2020-681149,2020-07-16,000001,Vente,120000,,,BOUTIER,B024,46220,46225,Prayssac,46,,,462250000D1406,,,,,,,,,,,,,0,,,,,VI,vignes,VAOC,Vins d'appellation d'origine contrôlée,695,1.18223,44.488651
2020-681149,2020-07-16,000001,Vente,120000,,,BOUTIER,B024,46220,46225,Prayssac,46,,,462250000D1407,,,,,,,,,,,,,0,,,,,VI,vignes,VAOC,Vins d'appellation d'origine contrôlée,2950,1.182791,44.488671
2020-681149,2020-07-16,000001,Vente,120000,,,BOUTIER,B024,46220,46225,Prayssac,46,,,462250000D1408,,,,,,,,,,,,,0,,,,,VI,vignes,VAOC,Vins d'appellation d'origine contrôlée,1349,1.183203,44.4888
2020-681149,2020-07-16,000001,Vente,120000,,,PLAINE DE BOUTIER,B165,46220,46225,Prayssac,46,,,462250000D1462,,,,,,,,,,,,,0,,,,,T,terres,,,2807,1.186829,44.488899
2020-681149,2020-07-16,000001,Vente,120000,,,PLAINE DE BOUTIER,B165,46220,46225,Prayssac,46,,,462250000D1462,,,,,,,,,,,,,0,,,,,T,terres,,,5614,1.186829,44.488899
2020-681149,2020-07-16,000001,Vente,120000,,,PLAINE DE BOUTIER,B165,46220,46225,Prayssac,46,,,462250000D1462,,,,,,,,,,,,,0,,,,,T,terres,,,730,1.186829,44.488899
2020-681149,2020-07-16,000001,Vente,120000,,,PLAINE DE BOUTIER,B165,46220,46225,Prayssac,46,,,462250000D1462,,,,,,,,,,,,,0,,,,,T,terres,,,1460,1.186829,44.488899
2020-681149,2020-07-16,000001,Vente,120000,,,PLAINE DE BOUTIER,B165,46220,46225,Prayssac,46,,,462250000D1462,,,,,,,,,,,,,0,,,,,VI,vignes,VAOC,Vins d'appellation d'origine contrôlée,2725,1.186829,44.488899
2020-681149,2020-07-16,000001,Vente,120000,,,PLAINE DE BOUTIER,B165,46220,46225,Prayssac,46,,,462250000D1533,,,,,,,,,,,,,0,,,,,T,terres,,,739,1.187001,44.488557
2020-681149,2020-07-16,000001,Vente,120000,,,PLAINE DE BOUTIER,B165,46220,46225,Prayssac,46,,,462250000D1533,,,,,,,,,,,,,0,,,,,T,terres,,,738,1.187001,44.488557
2020-681149,2020-07-16,000001,Vente,120000,,,LES GRAUZILS,B083,46220,46225,Prayssac,46,,,462250000D2013,,,,,,,,,,,,,0,,,,,VI,vignes,VAOC,Vins d'appellation d'origine contrôlée,1730,1.192937,44.480112
2020-681149,2020-07-16,000001,Vente,120000,,,LES CARIS,B042,46220,46225,Prayssac,46,,,462250000D2438,,,,,,,,,,,,,0,,,,,T,terres,,,1545,1.188236,44.487403