id_mutation,date_mutation,numero_disposition,nature_mutation,valeur_fonciere,adresse_numero,adresse_suffixe,adresse_nom_voie,adresse_code_voie,code_postal,code_commune,nom_commune,code_departement,ancien_code_commune,ancien_nom_commune,id_parcelle,ancien_id_parcelle,numero_volume,lot1_numero,lot1_surface_carrez,lot2_numero,lot2_surface_carrez,lot3_numero,lot3_surface_carrez,lot4_numero,lot4_surface_carrez,lot5_numero,lot5_surface_carrez,nombre_lots,code_type_local,type_local,surface_reelle_bati,nombre_pieces_principales,code_nature_culture,nature_culture,code_nature_culture_speciale,nature_culture_speciale,surface_terrain,longitude,latitude
2020-680083,2020-05-12,000001,Vente,118000,5106,F,LES TOURONS,B097,46300,46308,Soucirac,46,,,463080000B0476,,,,,,,,,,,,,0,1,Maison,141,4,J,jardins,POTAG,Jardin potager,1805,1.505269,44.701269
2020-680083,2020-05-12,000001,Vente,118000,5106,F,LES TOURONS,B097,46300,46308,Soucirac,46,,,463080000B0476,,,,,,,,,,,,,0,1,Maison,141,4,S,sols,,,500,1.505269,44.701269
2020-680083,2020-05-12,000001,Vente,118000,,,VITAREL,B104,46300,46308,Soucirac,46,,,463080000B0539,,,,,,,,,,,,,0,,,,,BT,taillis simples,,,2425,1.51421,44.698029
2020-680184,2020-05-20,000001,Vente,168800,,,LES COMBELES,B037,46300,46308,Soucirac,46,,,463080000A0605,,,,,,,,,,,,,0,,,,,T,terres,,,1680,1.485588,44.708441
2020-680184,2020-05-20,000001,Vente,168800,5060,,LES COMBELES,B037,46300,46308,Soucirac,46,,,463080000A0606,,,,,,,,,,,,,0,1,Maison,132,4,S,sols,,,310,1.485288,44.708533
2020-680461,2020-06-02,000001,Vente,3000,,,PECH DE LAURENT,B080,46300,46308,Soucirac,46,,,463080000A0395,,,,,,,,,,,,,0,,,,,T,terres,,,5978,1.501687,44.70939
2020-680461,2020-06-02,000001,Vente,3000,,,PECH DE LAURENT,B080,46300,46308,Soucirac,46,,,463080000A0395,,,,,,,,,,,,,0,,,,,T,terres,,,5977,1.501687,44.70939
2020-680705,2020-06-22,000001,Vente,1050,,,BARROUS,B002,46300,46308,Soucirac,46,,,463080000B0735,,,,,,,,,,,,,0,,,,,L,landes,,,210,1.511969,44.712122
2020-680818,2020-06-23,000001,Vente,100000,5079,,LA GREZE,B058,46300,46308,Soucirac,46,,,463080000A1110,,,,,,,,,,,,,0,1,Maison,74,4,T,terres,,,1888,1.511126,44.712513
2020-680818,2020-06-23,000001,Vente,100000,5079,,LA GREZE,B058,46300,46308,Soucirac,46,,,463080000A1110,,,,,,,,,,,,,0,3,Dépendance,,0,S,sols,,,500,1.511126,44.712513
2020-680818,2020-06-23,000001,Vente,100000,5079,,LA GREZE,B058,46300,46308,Soucirac,46,,,463080000A1110,,,,,,,,,,,,,0,1,Maison,74,4,S,sols,,,500,1.511126,44.712513
2020-680818,2020-06-23,000001,Vente,100000,5079,,LA GREZE,B058,46300,46308,Soucirac,46,,,463080000A1110,,,,,,,,,,,,,0,3,Dépendance,,0,T,terres,,,1888,1.511126,44.712513
2020-681636,2020-08-21,000001,Vente,165000,5075,,COMBE GOUDAILLE,B033,46300,46308,Soucirac,46,,,463080000A0338,,,,,,,,,,,,,0,3,Dépendance,,0,S,sols,,,960,1.477774,44.698915
2020-681636,2020-08-21,000001,Vente,165000,5075,,COMBE GOUDAILLE,B033,46300,46308,Soucirac,46,,,463080000A0338,,,,,,,,,,,,,0,1,Maison,132,5,S,sols,,,960,1.477774,44.698915
2020-681636,2020-08-21,000001,Vente,165000,,,COMBE GOUDAILLE,B033,46300,46308,Soucirac,46,,,463080000A0339,,,,,,,,,,,,,0,,,,,S,sols,,,100,1.477117,44.699221
2020-681636,2020-08-21,000001,Vente,165000,,,COMBE GOUDAILLE,B033,46300,46308,Soucirac,46,,,463080000A0339,,,,,,,,,,,,,0,,,,,T,terres,,,8805,1.477117,44.699221
2020-683715,2020-12-31,000001,Vente,165480,,,LA GOURGUE,B056,46300,46308,Soucirac,46,,,463080000A0625,,,,,,,,,,,,,0,,,,,L,landes,,,738,1.484564,44.70874
2020-683715,2020-12-31,000001,Vente,165480,5092,,LA GOURGUE,B056,46300,46308,Soucirac,46,,,463080000A0626,,,,,,,,,,,,,0,1,Maison,27,1,S,sols,,,500,1.484888,44.709233
2020-683715,2020-12-31,000001,Vente,165480,5092,,LA GOURGUE,B056,46300,46308,Soucirac,46,,,463080000A0626,,,,,,,,,,,,,0,1,Maison,27,1,S,sols,,,500,1.484888,44.709233
2020-683715,2020-12-31,000001,Vente,165480,5092,,LA GOURGUE,B056,46300,46308,Soucirac,46,,,463080000A0626,,,,,,,,,,,,,0,1,Maison,27,1,S,sols,,,500,1.484888,44.709233
2020-683715,2020-12-31,000001,Vente,165480,5092,,LA GOURGUE,B056,46300,46308,Soucirac,46,,,463080000A0626,,,,,,,,,,,,,0,3,Dépendance,,0,P,prés,,,4005,1.484888,44.709233
2020-683715,2020-12-31,000001,Vente,165480,5092,,LA GOURGUE,B056,46300,46308,Soucirac,46,,,463080000A0626,,,,,,,,,,,,,0,1,Maison,27,1,P,prés,,,4005,1.484888,44.709233
2020-683715,2020-12-31,000001,Vente,165480,5092,,LA GOURGUE,B056,46300,46308,Soucirac,46,,,463080000A0626,,,,,,,,,,,,,0,1,Maison,27,1,P,prés,,,4005,1.484888,44.709233
2020-683715,2020-12-31,000001,Vente,165480,5092,,LA GOURGUE,B056,46300,46308,Soucirac,46,,,463080000A0626,,,,,,,,,,,,,0,1,Maison,27,1,P,prés,,,4005,1.484888,44.709233
2020-683715,2020-12-31,000001,Vente,165480,5092,,LA GOURGUE,B056,46300,46308,Soucirac,46,,,463080000A0626,,,,,,,,,,,,,0,3,Dépendance,,0,S,sols,,,500,1.484888,44.709233
