id_mutation,date_mutation,numero_disposition,nature_mutation,valeur_fonciere,adresse_numero,adresse_suffixe,adresse_nom_voie,adresse_code_voie,code_postal,code_commune,nom_commune,code_departement,ancien_code_commune,ancien_nom_commune,id_parcelle,ancien_id_parcelle,numero_volume,lot1_numero,lot1_surface_carrez,lot2_numero,lot2_surface_carrez,lot3_numero,lot3_surface_carrez,lot4_numero,lot4_surface_carrez,lot5_numero,lot5_surface_carrez,nombre_lots,code_type_local,type_local,surface_reelle_bati,nombre_pieces_principales,code_nature_culture,nature_culture,code_nature_culture_speciale,nature_culture_speciale,surface_terrain,longitude,latitude
2020-684408,2020-02-26,000001,Vente,155000,125,,ALL DE L'ALBRET,0002,47130,47041,Bruch,47,,,470410000C0315,,,,,,,,,,,,,0,1,Maison,142,5,S,sols,,,355,0.409825,44.203589
2020-684408,2020-02-26,000001,Vente,155000,,,ALL DE L'ALBRET,0002,47130,47041,Bruch,47,,,470410000C0331,,,,,,,,,,,,,0,,,,,AG,terrains d'agrément,,,410,0.409701,44.203681
2020-684410,2020-02-27,000001,Vente,3000,,,LE BOURG,B027,47130,47041,Bruch,47,,,470410000C0168,,,,,,,,,,,,,0,,,,,S,sols,,,15,0.412492,44.204564
2020-684410,2020-02-27,000001,Vente,3000,,,LE BOURG,B027,47130,47041,Bruch,47,,,470410000C0169,,,,,,,,,,,,,0,,,,,J,jardins,,,210,0.412547,44.204541
2020-684410,2020-02-27,000001,Vente,3000,,,LE BOURG,B027,47130,47041,Bruch,47,,,470410000C0170,,,,,,,,,,,,,0,,,,,J,jardins,,,450,0.412657,44.204405
2020-684778,2020-04-28,000001,Vente,16758,,,CAILLAOUERE BAS,B036,47130,47041,Bruch,47,,,47041000ZC0023,,,,,,,,,,,,,0,,,,,T,terres,,,4190,0.42165,44.206623
2020-684778,2020-04-28,000001,Vente,16758,,,CAILLAOUERE BAS,B036,47130,47041,Bruch,47,,,47041000ZC0023,,,,,,,,,,,,,0,,,,,BP,peupleraies,,,7780,0.42165,44.206623
2020-684799,2020-04-22,000001,Vente,90000,273,,SAINT MARTIN SUD,B166,47130,47041,Bruch,47,,,470410000E0057,,,,,,,,,,,,,0,1,Maison,120,3,S,sols,,,880,0.387741,44.212551
2020-684799,2020-04-22,000001,Vente,90000,,,SAINT MARTIN SUD,B166,47130,47041,Bruch,47,,,470410000E0058,,,,,,,,,,,,,0,,,,,BT,taillis simples,,,1640,0.387218,44.212417
2020-684799,2020-04-22,000001,Vente,90000,,,SAINT MARTIN SUD,B166,47130,47041,Bruch,47,,,470410000E0058,,,,,,,,,,,,,0,,,,,T,terres,,,2380,0.387218,44.212417
2020-684842,2020-05-05,000001,Vente,24310,,,BAUBENS,B010,47130,47041,Bruch,47,,,47041000ZD0063,,,,,,,,,,,,,0,,,,,BP,peupleraies,,,18700,0.393408,44.21159
2020-685121,2020-05-22,000001,Vente,2000,,,SAINT MARTIN SUD,B166,47130,47041,Bruch,47,,,470410000E0059,,,,,,,,,,,,,0,,,,,BT,taillis simples,,,1280,0.386689,44.212335
2020-685121,2020-05-22,000001,Vente,2000,,,TOUTON,B176,47130,47041,Bruch,47,,,470410000E0792,,,,,,,,,,,,,0,,,,,P,prés,,,2395,0.389761,44.211344
2020-685249,2020-06-10,000002,Vente,143000,,,TRUC,B177,47130,47041,Bruch,47,,,470410000C1350,,,,,,,,,,,,,0,,,,,BT,taillis simples,,,584,0.417229,44.194329
2020-685249,2020-06-10,000002,Vente,143000,,,TRUC,B177,47130,47041,Bruch,47,,,470410000C1350,,,,,,,,,,,,,0,,,,,VI,vignes,VAOC,Vins d'appellation d'origine contrôlée,74015,0.417229,44.194329
2020-685249,2020-06-10,000002,Vente,143000,,,TRUC,B177,47130,47041,Bruch,47,,,470410000C1350,,,,,,,,,,,,,0,,,,,BT,taillis simples,,,876,0.417229,44.194329
2020-685510,2020-06-25,000001,Vente,177000,155,,BORDENEUVE,B022,47130,47041,Bruch,47,,,47041000ZD0153,,,,,,,,,,,,,0,1,Maison,134,5,P,prés,,,1415,0.409309,44.210089
2020-685510,2020-06-25,000001,Vente,177000,155,,BORDENEUVE,B022,47130,47041,Bruch,47,,,47041000ZD0153,,,,,,,,,,,,,0,1,Maison,134,5,S,sols,,,7002,0.409309,44.210089
2020-685656,2020-07-25,000001,Vente,35000,,,GRANDE ANTIOQUE,B074,47130,47041,Bruch,47,,,470410000C1471,,,,,,,,,,,,,0,,,,,P,prés,,,1970,0.413133,44.199893
2020-685656,2020-07-25,000001,Vente,35000,,,GRANDE ANTIOQUE,B074,47130,47041,Bruch,47,,,470410000C1472,,,,,,,,,,,,,0,,,,,P,prés,,,32,0.413446,44.199586
2020-685702,2020-07-24,000001,Vente,185000,282,,BASTARD NORD,B008,47130,47041,Bruch,47,,,470410000C1339,,,,,,,,,,,,,0,1,Maison,139,4,AG,terrains d'agrément,,,662,0.407774,44.202697
2020-685702,2020-07-24,000001,Vente,185000,282,,BASTARD NORD,B008,47130,47041,Bruch,47,,,470410000C1339,,,,,,,,,,,,,0,1,Maison,139,4,S,sols,,,728,0.407774,44.202697
2020-685973,2020-08-13,000001,Vente,65000,235,B,PENTES DU TRUC,B134,47130,47041,Bruch,47,,,470410000C0764,,,,,,,,,,,,,0,1,Maison,85,4,AG,terrains d'agrément,,,1105,0.412273,44.195257
2020-685973,2020-08-13,000001,Vente,65000,235,B,PENTES DU TRUC,B134,47130,47041,Bruch,47,,,470410000C0764,,,,,,,,,,,,,0,1,Maison,85,4,S,sols,,,870,0.412273,44.195257
2020-685973,2020-08-13,000001,Vente,65000,,,PENTES DU TRUC,B134,47130,47041,Bruch,47,,,470410000C0766,,,,,,,,,,,,,0,,,,,T,terres,,,3300,0.413026,44.195903
2020-686451,2020-10-09,000001,Vente,161050,136,,LE BOURG,B027,47130,47041,Bruch,47,,,470410000C0324,,,,,,,,,,,,,0,1,Maison,220,8,S,sols,,,353,0.410342,44.204231
2020-686552,2020-10-21,000001,Vente,110000,5494,,GARAS,B069,47130,47041,Bruch,47,,,470410000C1331,,,,,,,,,,,,,0,1,Maison,67,3,S,sols,,,607,0.41875,44.198315
2020-686552,2020-10-21,000001,Vente,110000,5494,,GARAS,B069,47130,47041,Bruch,47,,,470410000C1331,,,,,,,,,,,,,0,1,Maison,67,3,T,terres,,,1412,0.41875,44.198315
2020-686880,2020-10-23,000001,Vente,28000,,,GRANDE ANTIOQUE,B074,47130,47041,Bruch,47,,,470410000C1464,,,,,,,,,,,,,0,,,,,AB,terrains a bâtir,,,1981,0.413809,44.200489
2020-686880,2020-10-23,000001,Vente,28000,,,GRANDE ANTIOQUE,B074,47130,47041,Bruch,47,,,470410000C1465,,,,,,,,,,,,,0,,,,,P,prés,,,180,0.413967,44.20035
2020-686880,2020-10-23,000001,Vente,28000,,,GRANDE ANTIOQUE,B074,47130,47041,Bruch,47,,,470410000C1468,,,,,,,,,,,,,0,,,,,P,prés,,,5,0.414004,44.200726
2020-687136,2020-12-09,000002,Vente,89860,,,GARAS,B069,47130,47041,Bruch,47,,,470410000C0446,,,,,,,,,,,,,0,,,,,VI,vignes,VAOC,Vins d'appellation d'origine contrôlée,3020,0.420122,44.196555
2020-687137,2020-12-09,000003,Vente,3460,,,GARAS,B069,47130,47041,Bruch,47,,,470410000C1484,,,,,,,,,,,,,0,,,,,VI,vignes,VAOC,Vins d'appellation d'origine contrôlée,2713,0.418555,44.197224
2020-687246,2020-12-16,000001,Vente,103000,149,,SAINT MARTIN NORD,B165,47130,47041,Bruch,47,,,47041000ZD0074,,,,,,,,,,,,,0,1,Maison,70,2,J,jardins,,,2580,0.388617,44.212783
2020-687247,2020-12-01,000001,Vente,36000,91,,RUE ARNAUD DE PARDAILLAN,0003,47130,47041,Bruch,47,,,470410000C0262,,,,,,,,,,,,,0,1,Maison,80,2,S,sols,,,60,0.411004,44.204696
2020-687290,2020-12-17,000001,Vente,4500,,,LAVERNY,B103,47130,47041,Bruch,47,,,470410000C1033,,,,,,,,,,,,,0,,,,,T,terres,,,6379,0.413461,44.192982
