id_mutation,date_mutation,numero_disposition,nature_mutation,valeur_fonciere,adresse_numero,adresse_suffixe,adresse_nom_voie,adresse_code_voie,code_postal,code_commune,nom_commune,code_departement,ancien_code_commune,ancien_nom_commune,id_parcelle,ancien_id_parcelle,numero_volume,lot1_numero,lot1_surface_carrez,lot2_numero,lot2_surface_carrez,lot3_numero,lot3_surface_carrez,lot4_numero,lot4_surface_carrez,lot5_numero,lot5_surface_carrez,nombre_lots,code_type_local,type_local,surface_reelle_bati,nombre_pieces_principales,code_nature_culture,nature_culture,code_nature_culture_speciale,nature_culture_speciale,surface_terrain,longitude,latitude
2020-692122,2020-02-19,000001,Vente,2000,,,LOU RIOU,B362,48000,48013,Badaroux,48,,,48013000AH0062,,,,,,,,,,,,,0,,,,,L,landes,,,5635,3.571178,44.542983
2020-692122,2020-02-19,000001,Vente,2000,,,LOU RIOU,B362,48000,48013,Badaroux,48,,,48013000AH0066,,,,,,,,,,,,,0,,,,,L,landes,,,5235,3.571711,44.544233
2020-692122,2020-02-19,000001,Vente,2000,,,LOU RIOU,B362,48000,48013,Badaroux,48,,,48013000AH0068,,,,,,,,,,,,,0,,,,,L,landes,,,3975,3.5719,44.543548
2020-692122,2020-02-19,000001,Vente,2000,,,LOU PLO,B341,48000,48013,Badaroux,48,,,48013000AH0080,,,,,,,,,,,,,0,,,,,L,landes,,,5375,3.57531,44.544162
2020-692261,2020-03-13,000001,Vente,198000,5291,,LOT LOU PAIS,A025,48000,48013,Badaroux,48,,,48013000AR0823,,,,,,,,,,,,,0,1,Maison,135,4,S,sols,,,451,3.540373,44.532431
2020-692648,2020-05-29,000001,Echange,1,,,RUE DES BRUYERES,0019,48000,48013,Badaroux,48,,,48013000AR0945,,,,,,,,,,,,,0,,,,,AB,terrains a bâtir,,,79,3.546672,44.532872
2020-692648,2020-05-29,000002,Echange,1,,,CHE DE LA GARE,0067,48000,48013,Badaroux,48,,,48013000AR0948,,,,,,,,,,,,,0,,,,,S,sols,,,12,3.546449,44.532967
2020-692712,2020-05-30,000001,Vente,225585,6,,RUE DES BRUYERES,0019,48000,48013,Badaroux,48,,,48013000AR0778,,,,,,,,,,,,,0,1,Maison,87,4,S,sols,,,306,3.54692,44.532787
2020-692922,2020-07-06,000001,Vente,130000,,,NOJARET,B441,48000,48013,Badaroux,48,,,48013000AL0040,,,,,,,,,,,,,0,,,,,J,jardins,,,132,3.578829,44.530189
2020-692922,2020-07-06,000001,Vente,130000,5211,,NOJARET,B441,48000,48013,Badaroux,48,,,48013000AL0041,,,,,,,,,,,,,0,1,Maison,99,3,S,sols,,,745,3.57855,44.530185
2020-692922,2020-07-06,000001,Vente,130000,,,NOJARET,B441,48000,48013,Badaroux,48,,,48013000AL0042,,,,,,,,,,,,,0,,,,,J,jardins,,,180,3.578504,44.529962
2020-692922,2020-07-06,000001,Vente,130000,,,LOU BELOUDIER,B299,48000,48013,Badaroux,48,,,48013000AL0049,,,,,,,,,,,,,0,,,,,L,landes,,,1240,3.579149,44.529953
2020-692922,2020-07-06,000001,Vente,130000,,,LOU BELOUDIER,B299,48000,48013,Badaroux,48,,,48013000AL0050,,,,,,,,,,,,,0,,,,,P,prés,,,1085,3.57893,44.530045
2020-693181,2020-08-25,000001,Vente,204800,26,,RUE DES BRUYERES,0019,48000,48013,Badaroux,48,,,48013000AR0788,,,,,,,,,,,,,0,1,Maison,97,4,S,sols,,,577,3.548805,44.533429
2020-693286,2020-09-17,000001,Vente,17421,,,BADAROUX VILLAGE,B027,48000,48013,Badaroux,48,,,48013000AW0721,,,,,,,,,,,,,0,,,,,S,sols,,,10,3.551496,44.535855
2020-693286,2020-09-17,000001,Vente,17421,30,,AV JEAN ANTOINE CHAPTAL,0083,48000,48013,Badaroux,48,,,48013000AW0722,,,,,,,,,,,,,0,1,Maison,60,2,S,sols,,,147,3.551559,44.535824
2020-693856,2020-06-23,000001,Vente,120000,1,,CHE DES DEUX BOUCHES,0042,48000,48013,Badaroux,48,,,48013000AR0711,,,226,,,,,,,,,,1,3,Dépendance,,0,,,,,,3.545977,44.535728
2020-693856,2020-06-23,000001,Vente,120000,1,,CHE DES DEUX BOUCHES,0042,48000,48013,Badaroux,48,,,48013000AR0711,,,215,72.5,,,,,,,,,1,2,Appartement,72,3,,,,,,3.545977,44.535728
2020-693886,2020-12-10,000001,Vente,125000,4,,RUE LAMARTINE,0090,48000,48013,Badaroux,48,,,48013000AR0453,,,,,,,,,,,,,0,1,Maison,84,4,S,sols,,,470,3.542173,44.534806
2020-693983,2020-12-18,000001,Vente,60000,,,LA COMBE,B149,48000,48013,Badaroux,48,,,48013000AR0941,,,,,,,,,,,,,0,,,,,AB,terrains a bâtir,,,727,3.544332,44.533269
2020-694095,2020-12-29,000001,Vente,155575,25,,RUE DES CHENES,0026,48000,48013,Badaroux,48,,,48013000AR0507,,,,,,,,,,,,,0,1,Maison,87,4,S,sols,,,173,3.542538,44.533867
