id_mutation,date_mutation,numero_disposition,nature_mutation,valeur_fonciere,adresse_numero,adresse_suffixe,adresse_nom_voie,adresse_code_voie,code_postal,code_commune,nom_commune,code_departement,ancien_code_commune,ancien_nom_commune,id_parcelle,ancien_id_parcelle,numero_volume,lot1_numero,lot1_surface_carrez,lot2_numero,lot2_surface_carrez,lot3_numero,lot3_surface_carrez,lot4_numero,lot4_surface_carrez,lot5_numero,lot5_surface_carrez,nombre_lots,code_type_local,type_local,surface_reelle_bati,nombre_pieces_principales,code_nature_culture,nature_culture,code_nature_culture_speciale,nature_culture_speciale,surface_terrain,longitude,latitude
2020-691994,2020-01-28,000002,Vente,12600,,,GREZES,B328,48100,48072,Grèzes,48,,,480720000A0542,,,,,,,,,,,,,0,,,,,J,jardins,,,142,3.335116,44.513531
2020-691994,2020-01-28,000002,Vente,12600,,,GREZES,B328,48100,48072,Grèzes,48,,,480720000A0543,,,,,,,,,,,,,0,,,,,J,jardins,,,179,3.335279,44.513567
2020-691994,2020-01-28,000002,Vente,12600,5023,,GREZES,B328,48100,48072,Grèzes,48,,,480720000A1101,,,,,,,,,,,,,0,1,Maison,50,1,S,sols,,,317,3.336687,44.512725
2020-692240,2020-03-05,000001,Vente,,,,GREZES,B328,48100,48072,Grèzes,48,,,480720000A1102,,,,,,,,,,,,,0,,,,,S,sols,,,40,3.336726,44.512764
2020-692271,2020-03-05,000001,Vente,3050,,,VEYRAC,B711,48100,48072,Grèzes,48,,,480720000B1272,,,,,,,,,,,,,0,,,,,J,jardins,,,610,3.369198,44.523628
2020-692272,2020-03-05,000001,Vente,1000,,,TRAVERS DE LA DRAYE,B694,48100,48072,Grèzes,48,,,480720000B1563,,,,,,,,,,,,,0,,,,,AB,terrains a bâtir,,,1106,3.370982,44.524256
2020-692273,2020-03-05,000001,Vente,200,,,VEYRAC,B711,48100,48072,Grèzes,48,,,480720000B1557,,,,,,,,,,,,,0,,,,,S,sols,,,60,3.369058,44.524089
2020-692273,2020-03-05,000001,Vente,200,,,PUECH MA,B610,48100,48072,Grèzes,48,,,480720000B1554,,,,,,,,,,,,,0,,,,,L,landes,,,67,3.369257,44.524177
2020-692358,2020-03-11,000002,Vente,26850,,,LA PARRO,B525,48100,48072,Grèzes,48,,,480720000B1569,,,,,,,,,,,,,0,,,,,T,terres,,,895,3.351654,44.508689
2020-692572,2020-05-29,000001,Vente,400,,,GALANDOU,B315,48100,48072,Grèzes,48,,,480720000A0995,,,,,,,,,,,,,0,,,,,P,prés,,,1597,3.320816,44.513842
2020-692583,2020-05-29,000001,Vente,15912.4,,,LAS FAISSES,B366,48100,48072,Grèzes,48,,,480720000A0052,,,,,,,,,,,,,0,,,,,P,prés,,,9415,3.332639,44.516996
2020-692583,2020-05-29,000001,Vente,15912.4,,,LA FAISSE,B295,48100,48072,Grèzes,48,,,480720000A0054,,,,,,,,,,,,,0,,,,,P,prés,,,3997,3.332343,44.516385
2020-692583,2020-05-29,000001,Vente,15912.4,,,PRAT DE TRAS LOU CHASTEL,B591,48100,48072,Grèzes,48,,,480720000A0057,,,,,,,,,,,,,0,,,,,P,prés,,,3225,3.334155,44.515902
2020-692583,2020-05-29,000001,Vente,15912.4,,,PASTURAL DE TRAS LOU PUECH,B538,48100,48072,Grèzes,48,,,480720000A0058,,,,,,,,,,,,,0,,,,,PA,pâtures,PATUR,Pâture plantée,3029,3.333821,44.516395
2020-692583,2020-05-29,000001,Vente,15912.4,,,FONTANILLE,B302,48100,48072,Grèzes,48,,,480720000A0317,,,,,,,,,,,,,0,,,,,T,terres,,,6110,3.331632,44.514835
2020-692583,2020-05-29,000001,Vente,15912.4,,,FONTANILLE,B302,48100,48072,Grèzes,48,,,480720000A0374,,,,,,,,,,,,,0,,,,,T,terres,,,9327,3.330709,44.51459
2020-692583,2020-05-29,000001,Vente,15912.4,,,LA COUREJOLE,B256,48100,48072,Grèzes,48,,,480720000A0375,,,,,,,,,,,,,0,,,,,T,terres,,,4678,3.331153,44.514058
2020-692895,2020-07-21,000001,Vente,750,5117,,GREZES,B328,48100,48072,Grèzes,48,,,480720000A0540,,,,,,,,,,,,,0,3,Dépendance,,0,S,sols,,,158,3.335249,44.513225
2020-693015,2020-07-30,000001,Vente,70,,,TRAVERS DE LA DRAYE,B694,48100,48072,Grèzes,48,,,480720000B1567,,,,,,,,,,,,,0,,,,,AB,terrains a bâtir,,,88,3.369597,44.524251
2020-693017,2020-07-30,000001,Vente,130,,,TRAVERS DE LA DRAYE,B694,48100,48072,Grèzes,48,,,480720000B1564,,,,,,,,,,,,,0,,,,,AB,terrains a bâtir,,,38,3.369622,44.524294
2020-693017,2020-07-30,000001,Vente,130,,,PUECH MA,B610,48100,48072,Grèzes,48,,,480720000B1566,,,,,,,,,,,,,0,,,,,AB,terrains a bâtir,,,129,3.369476,44.524274
2020-693209,2020-09-07,000001,Vente,200,,,GREZES,B328,48100,48072,Grèzes,48,,,480720000A0452,,,,,,,,,,,,,0,,,,,L,landes,,,66,3.337695,44.512632
2020-693462,2020-10-05,000001,Vente,55600,,,LA SAFRANIERE,B639,48100,48072,Grèzes,48,,,480720000B1042,,,,,,,,,,,,,0,,,,,L,landes,,,2639,3.345276,44.509356
2020-693462,2020-10-05,000001,Vente,55600,5050,,LE SERRE,B458,48100,48072,Grèzes,48,,,480720000B1064,,,,,,,,,,,,,0,1,Maison,87,3,S,sols,,,405,3.345059,44.509459
2020-693462,2020-10-05,000001,Vente,55600,,,LE SERRE,B458,48100,48072,Grèzes,48,,,480720000B1066,,,,,,,,,,,,,0,,,,,J,jardins,,,165,3.344947,44.508917
2020-693603,2020-10-23,000001,Vente,125000,,,SERRE SEC,B660,48100,48072,Grèzes,48,,,480720000A1084,,,,,,,,,,,,,0,,,,,T,terres,,,5114,3.315296,44.511764
2020-693767,2020-11-18,000001,Vente,41000,5111,,CHAUSSERANS,B102,48100,48072,Grèzes,48,,,480720000B1160,,,,,,,,,,,,,0,1,Maison,100,2,S,sols,,,222,3.344628,44.526413
2020-694042,2020-12-23,000001,Vente,1000,,,SERRE GABIO,B657,48100,48072,Grèzes,48,,,480720000B0041,,,,,,,,,,,,,0,,,,,L,landes,,,1540,3.343587,44.532826
2020-694042,2020-12-23,000001,Vente,1000,,,LA MAZOTTE,B507,48100,48072,Grèzes,48,,,480720000B0043,,,,,,,,,,,,,0,,,,,P,prés,,,774,3.343164,44.53265
2020-694042,2020-12-23,000001,Vente,1000,,,LA MAZOTTE,B507,48100,48072,Grèzes,48,,,480720000B0043,,,,,,,,,,,,,0,,,,,P,prés,,,1546,3.343164,44.53265
