id_mutation,date_mutation,numero_disposition,nature_mutation,valeur_fonciere,adresse_numero,adresse_suffixe,adresse_nom_voie,adresse_code_voie,code_postal,code_commune,nom_commune,code_departement,ancien_code_commune,ancien_nom_commune,id_parcelle,ancien_id_parcelle,numero_volume,lot1_numero,lot1_surface_carrez,lot2_numero,lot2_surface_carrez,lot3_numero,lot3_surface_carrez,lot4_numero,lot4_surface_carrez,lot5_numero,lot5_surface_carrez,nombre_lots,code_type_local,type_local,surface_reelle_bati,nombre_pieces_principales,code_nature_culture,nature_culture,code_nature_culture_speciale,nature_culture_speciale,surface_terrain,longitude,latitude
2020-691959,2020-01-18,000001,Vente,1,,,LOU RAMLDA,B186,48500,48181,Saint-Saturnin,48,,,481810000C0161,,,,,,,,,,,,,0,,,,,T,terres,,,534,,
2020-691959,2020-01-18,000001,Vente,1,,,CON DE TRENCHAR,B063,48500,48181,Saint-Saturnin,48,,,481810000C0168,,,,,,,,,,,,,0,,,,,T,terres,,,37,,
2020-691959,2020-01-18,000001,Vente,1,,,LA PLANETTE,B230,48500,48181,Saint-Saturnin,48,,,481810000C0164,,,,,,,,,,,,,0,,,,,L,landes,,,386,,
2020-691959,2020-01-18,000001,Vente,1,,,CAP DE COSTE,B035,48500,48181,Saint-Saturnin,48,,,481810000C0174,,,,,,,,,,,,,0,,,,,T,terres,,,47,,
2020-691960,2020-01-18,000001,Vente,2201,,,SAINT SATURNIN,B264,48500,48181,Saint-Saturnin,48,,,481810000A0326,,,,,,,,,,,,,0,,,,,J,jardins,,,270,,
2020-691960,2020-01-18,000001,Vente,2201,,,CAP DE COSTE,B035,48500,48181,Saint-Saturnin,48,,,481810000C0172,,,,,,,,,,,,,0,,,,,T,terres,,,397,,
2020-691960,2020-01-18,000001,Vente,2201,,,CAP DE COSTE,B035,48500,48181,Saint-Saturnin,48,,,481810000C0180,,,,,,,,,,,,,0,,,,,T,terres,,,237,,
2020-692016,2020-02-02,000001,Vente,1,,,CAP DE COSTE,B035,48500,48181,Saint-Saturnin,48,,,481810000C0170,,,,,,,,,,,,,0,,,,,L,landes,,,34,,
2020-692198,2020-02-21,000001,Vente,8000,,,CON DEL POUS,B066,48500,48181,Saint-Saturnin,48,,,481810000B0137,,,,,,,,,,,,,0,,,,,L,landes,,,3056,3.206836,44.394368
2020-692198,2020-02-21,000001,Vente,8000,,,CON DEL POUS,B066,48500,48181,Saint-Saturnin,48,,,481810000B0138,,,,,,,,,,,,,0,,,,,BT,taillis simples,,,21474,3.206375,44.393624
2020-692198,2020-02-21,000001,Vente,8000,,,SERRE DE ROUME,B268,48500,48181,Saint-Saturnin,48,,,481810000B0162,,,,,,,,,,,,,0,,,,,L,landes,,,640,3.203694,44.393351
2020-692198,2020-02-21,000001,Vente,8000,,,SERRE DE ROUME,B268,48500,48181,Saint-Saturnin,48,,,481810000B0164,,,,,,,,,,,,,0,,,,,BT,taillis simples,,,4790,3.204044,44.39323
2020-692198,2020-02-21,000001,Vente,8000,,,CHON DE LA FOUON,B044,48500,48181,Saint-Saturnin,48,,,481810000B0165,,,,,,,,,,,,,0,,,,,L,landes,,,7574,3.205726,44.392465
2020-692198,2020-02-21,000001,Vente,8000,,,PINATEL DE LA FOUON,B227,48500,48181,Saint-Saturnin,48,,,481810000B0167,,,,,,,,,,,,,0,,,,,L,landes,,,2420,3.205798,44.39142
2020-692198,2020-02-21,000001,Vente,8000,,,CHON DE LA FOUON,B044,48500,48181,Saint-Saturnin,48,,,481810000B0168,,,,,,,,,,,,,0,,,,,T,terres,,,16864,3.207241,44.391824
2020-692198,2020-02-21,000001,Vente,8000,,,CHON DE LA FOUON,B044,48500,48181,Saint-Saturnin,48,,,481810000B0168,,,,,,,,,,,,,0,,,,,L,landes,,,8432,3.207241,44.391824
2020-692198,2020-02-21,000001,Vente,8000,,,CHON DE LA FOUON,B044,48500,48181,Saint-Saturnin,48,,,481810000B0174,,,,,,,,,,,,,0,,,,,L,landes,,,8072,3.207771,44.390916
2020-692267,2020-03-04,000001,Vente,1,,,CAP DE COSTE,B035,48500,48181,Saint-Saturnin,48,,,481810000C0176,,,,,,,,,,,,,0,,,,,T,terres,,,49,,
2020-693102,2020-08-14,000001,Vente,130660,5023,,SAINT SATURNIN,B264,48500,48181,Saint-Saturnin,48,,,481810000A0317,,,,,,,,,,,,,0,3,Dépendance,,0,S,sols,,,497,3.188252,44.411816
2020-693102,2020-08-14,000001,Vente,130660,5023,,SAINT SATURNIN,B264,48500,48181,Saint-Saturnin,48,,,481810000A0317,,,,,,,,,,,,,0,1,Maison,64,3,S,sols,,,497,3.188252,44.411816
2020-693225,2020-09-04,000001,Vente,6000,,,LA TRANIERE,B284,48500,48181,Saint-Saturnin,48,,,481810000A0169,,,,,,,,,,,,,0,,,,,T,terres,,,8040,3.187329,44.410352
