id_mutation,date_mutation,numero_disposition,nature_mutation,valeur_fonciere,adresse_numero,adresse_suffixe,adresse_nom_voie,adresse_code_voie,code_postal,code_commune,nom_commune,code_departement,ancien_code_commune,ancien_nom_commune,id_parcelle,ancien_id_parcelle,numero_volume,lot1_numero,lot1_surface_carrez,lot2_numero,lot2_surface_carrez,lot3_numero,lot3_surface_carrez,lot4_numero,lot4_surface_carrez,lot5_numero,lot5_surface_carrez,nombre_lots,code_type_local,type_local,surface_reelle_bati,nombre_pieces_principales,code_nature_culture,nature_culture,code_nature_culture_speciale,nature_culture_speciale,surface_terrain,longitude,latitude
2020-727469,2020-03-02,000001,Vente,325000,5241,,RUE DE LA GRANDE CARRIERE,0025,51150,51018,Athis,51,,,51018000ZS0126,,,,,,,,,,,,,0,4,Local industriel. commercial ou assimilé,395,0,S,sols,,,4840,4.131218,49.012971
2020-727763,2020-02-17,000002,Echange,970,15,,RUE DE LA GARE,0024,51150,51018,Athis,51,,,51018000AA0144,,,,,,,,,,,,,0,,,,,S,sols,,,97,4.126817,49.019676
2020-727763,2020-02-17,000003,Echange,970,,,LE VILLAGE OUEST,B104,51150,51018,Athis,51,,,51018000AA0141,,,,,,,,,,,,,0,,,,,S,sols,,,97,4.126499,49.019811
2020-727934,2020-06-30,000001,Vente,56616,,,GRANDE CARRIERE,B048,51150,51018,Athis,51,,,51018000ZS0115,,,,,,,,,,,,,0,,,,,S,sols,,,1686,4.131762,49.014149
2020-727934,2020-06-30,000001,Vente,56616,,,GRANDE CARRIERE,B048,51150,51018,Athis,51,,,51018000ZS0117,,,,,,,,,,,,,0,,,,,S,sols,,,1010,4.132088,49.01411
2020-728098,2020-08-07,000001,Vente,233500,2,,RUE SAINT ELOI,0046,51150,51018,Athis,51,,,51018000AB0185,,,,,,,,,,,,,0,1,Maison,104,5,S,sols,,,1290,4.129285,49.016981
2020-728179,2020-09-03,000001,Vente,197970,9,,RUE ROGER ZIMMERMANN,0045,51150,51018,Athis,51,,,51018000AC0128,,,,,,,,,,,,,0,1,Maison,112,4,S,sols,,,521,4.127361,49.013119
2020-728304,2020-09-28,000001,Vente,56000,,,LE VILLAGE EST,B105,51150,51018,Athis,51,,,51018000AB0051,,,,,,,,,,,,,0,,,,,S,sols,,,190,4.132003,49.017112
2020-728304,2020-09-28,000001,Vente,56000,43,,RUE CAMILLE SOUDANT,0007,51150,51018,Athis,51,,,51018000AB0355,,,,,,,,,,,,,0,1,Maison,68,3,S,sols,,,466,4.13213,49.017036
2020-728304,2020-09-28,000001,Vente,56000,3,,RUE DU POMMEAU,0041,51150,51018,Athis,51,,,51018000AB0358,,,,,,,,,,,,,0,,,,,S,sols,,,3,4.132117,49.017164
2020-728357,2020-09-29,000001,Vente,185000,9,,RUE DES PROVENTES,0044,51150,51018,Athis,51,,,51018000AB0343,,,,,,,,,,,,,0,1,Maison,80,4,S,sols,,,1022,4.13371,49.018671
2020-728357,2020-09-29,000001,Vente,185000,9,,RUE DES PROVENTES,0044,51150,51018,Athis,51,,,51018000AB0343,,,,,,,,,,,,,0,1,Maison,48,2,S,sols,,,1022,4.13371,49.018671
2020-736727,2020-10-28,000001,Vente,70300,,,LES PROVENTES,B090,51150,51018,Athis,51,,,51018000AB0336,,,,,,,,,,,,,0,,,,,AB,terrains a bâtir,,,703,4.135584,49.017541
2020-737635,2020-12-02,000001,Vente,108000,,,GRANDE CARRIERE,B048,51150,51018,Athis,51,,,51018000ZS0150,,,,,,,,,,,,,0,,,,,T,terres,,,6000,4.131645,49.011714
2020-737671,2020-11-19,000001,Vente,4338,,,GRANDE CARRIERE,B048,51150,51018,Athis,51,,,51018000ZS0156,,,,,,,,,,,,,0,,,,,AB,terrains a bâtir,,,241,4.132268,49.01353
2020-737673,2020-11-19,000001,Vente,17928,,,GRANDE CARRIERE,B048,51150,51018,Athis,51,,,51018000ZS0155,,,,,,,,,,,,,0,,,,,T,terres,,,996,4.13264,49.013539
2020-739030,2020-12-18,000001,Vente,16200,,,GRANDE CARRIERE,B048,51150,51018,Athis,51,,,51018000ZS0142,,,,,,,,,,,,,0,,,,,T,terres,,,900,4.132709,49.012704
