id_mutation,date_mutation,numero_disposition,nature_mutation,valeur_fonciere,adresse_numero,adresse_suffixe,adresse_nom_voie,adresse_code_voie,code_postal,code_commune,nom_commune,code_departement,ancien_code_commune,ancien_nom_commune,id_parcelle,ancien_id_parcelle,numero_volume,lot1_numero,lot1_surface_carrez,lot2_numero,lot2_surface_carrez,lot3_numero,lot3_surface_carrez,lot4_numero,lot4_surface_carrez,lot5_numero,lot5_surface_carrez,nombre_lots,code_type_local,type_local,surface_reelle_bati,nombre_pieces_principales,code_nature_culture,nature_culture,code_nature_culture_speciale,nature_culture_speciale,surface_terrain,longitude,latitude
2020-728412,2020-01-25,000001,Vente,86000,,,LE VILLAGE,B063,51340,51290,Heiltz-l'Évêque,51,,,51290000AB0017,,,,,,,,,,,,,0,,,,,P,prés,,,1586,4.738872,48.779344
2020-728412,2020-01-25,000001,Vente,86000,,,LE VILLAGE,B063,51340,51290,Heiltz-l'Évêque,51,,,51290000AB0017,,,,,,,,,,,,,0,,,,,S,sols,,,502,4.738872,48.779344
2020-728412,2020-01-25,000001,Vente,86000,,,LE VILLAGE,B063,51340,51290,Heiltz-l'Évêque,51,,,51290000AB0018,,,,,,,,,,,,,0,,,,,S,sols,,,614,4.739128,48.778892
2020-728412,2020-01-25,000001,Vente,86000,2,,RUE DU LIEUTENANT PICHARD,0029,51340,51290,Heiltz-l'Évêque,51,,,51290000AB0019,,,,,,,,,,,,,0,1,Maison,155,5,S,sols,,,380,4.739308,48.778947
2020-729111,2020-08-27,000001,Vente,159000,,,LE VILLAGE,B063,51340,51290,Heiltz-l'Évêque,51,,,51290000AB0222,,,,,,,,,,,,,0,,,,,S,sols,,,910,4.741166,48.778354
2020-729111,2020-08-27,000001,Vente,159000,,,LE VILLAGE,B063,51340,51290,Heiltz-l'Évêque,51,,,51290000AB0223,,,,,,,,,,,,,0,,,,,S,sols,,,721,4.740985,48.778288
2020-729111,2020-08-27,000001,Vente,159000,5,,RUE PRINCIPALE,0020,51340,51290,Heiltz-l'Évêque,51,,,51290000AB0224,,,,,,,,,,,,,0,1,Maison,179,6,S,sols,,,2165,4.740926,48.778682
2020-729144,2020-09-01,000002,Echange,500,,,LE PAQUIS MOE,B041,51340,51290,Heiltz-l'Évêque,51,,,51290000ZD0155,,,,,,,,,,,,,0,,,,,BP,peupleraies,,,2660,4.731245,48.771011
2020-729146,2020-09-01,000001,Vente,2300,,,LE PAQUIS MOE,B041,51340,51290,Heiltz-l'Évêque,51,,,51290000ZD0155,,,,,,,,,,,,,0,,,,,BP,peupleraies,,,2660,4.731245,48.771011
2020-735755,2020-10-03,000001,Vente,246346,,,LES SORANGES,B059,51340,51290,Heiltz-l'Évêque,51,,,51290000ZH0049,,,,,,,,,,,,,0,,,,,T,terres,,,2200,4.731102,48.782004
2020-735755,2020-10-03,000001,Vente,246346,,,LES SORANGES,B059,51340,51290,Heiltz-l'Évêque,51,,,51290000ZH0050,,,,,,,,,,,,,0,,,,,T,terres,,,15600,4.72682,48.782192
2020-735755,2020-10-03,000001,Vente,246346,,,LES SORANGES,B059,51340,51290,Heiltz-l'Évêque,51,,,51290000ZH0051,,,,,,,,,,,,,0,,,,,P,prés,,,18180,4.724684,48.783605
2020-735755,2020-10-03,000001,Vente,246346,,,LES SORANGES,B059,51340,51290,Heiltz-l'Évêque,51,,,51290000ZH0052,,,,,,,,,,,,,0,,,,,T,terres,,,174742,4.72769,48.785255
2020-735755,2020-10-03,000001,Vente,246346,,,LES SORANGES,B059,51340,51290,Heiltz-l'Évêque,51,,,51290000ZH0052,,,,,,,,,,,,,0,,,,,T,terres,,,97238,4.72769,48.785255
2020-736331,2020-10-09,000001,Vente,2150,,,LE VILLAGE,B063,51340,51290,Heiltz-l'Évêque,51,,,51290000AB0087,,,,,,,,,,,,,0,,,,,J,jardins,,,584,4.743967,48.780756
2020-736331,2020-10-09,000001,Vente,2150,,,LE VILLAGE,B063,51340,51290,Heiltz-l'Évêque,51,,,51290000AB0088,,,,,,,,,,,,,0,,,,,J,jardins,,,43,4.744126,48.780683
2020-738751,2020-12-22,000001,Vente,5300,,,LA NOUE D OURNEL,B038,51340,51290,Heiltz-l'Évêque,51,,,51290000ZB0007,,,,,,,,,,,,,0,,,,,T,terres,,,8830,4.762629,48.777308
