id_mutation,date_mutation,numero_disposition,nature_mutation,valeur_fonciere,adresse_numero,adresse_suffixe,adresse_nom_voie,adresse_code_voie,code_postal,code_commune,nom_commune,code_departement,ancien_code_commune,ancien_nom_commune,id_parcelle,ancien_id_parcelle,numero_volume,lot1_numero,lot1_surface_carrez,lot2_numero,lot2_surface_carrez,lot3_numero,lot3_surface_carrez,lot4_numero,lot4_surface_carrez,lot5_numero,lot5_surface_carrez,nombre_lots,code_type_local,type_local,surface_reelle_bati,nombre_pieces_principales,code_nature_culture,nature_culture,code_nature_culture_speciale,nature_culture_speciale,surface_terrain,longitude,latitude
2020-728481,2020-02-06,000001,Vente,34000,,,LE CHAMP LE PRETRE,B009,51300,51433,Plichancourt,51,,,51433000ZH0125,,,,,,,,,,,,,0,,,,,AB,terrains a bâtir,,,990,4.671665,48.744913
2020-728496,2020-02-13,000001,Vente,60000,21,,RUE DE L ORME,0060,51300,51433,Plichancourt,51,,,51433000AB0013,,,,,,,,,,,,,0,1,Maison,82,1,S,sols,,,210,4.677791,48.745795
2020-728551,2020-03-07,000002,Vente,540,,,LE VILLAGE,B057,51300,51433,Plichancourt,51,,,51433000AB0265,,,,,,,,,,,,,0,,,,,S,sols,,,8,4.675278,48.745252
2020-728551,2020-03-07,000002,Vente,540,,,LE VILLAGE,B057,51300,51433,Plichancourt,51,,,51433000AB0266,,,,,,,,,,,,,0,,,,,S,sols,,,10,4.674949,48.745211
2020-728552,2020-03-07,000002,Vente,2160,,,LE VILLAGE,B057,51300,51433,Plichancourt,51,,,51433000AB0249,,,,,,,,,,,,,0,,,,,J,jardins,,,72,4.676735,48.745703
2020-728554,2020-03-07,000002,Vente,1140,,,LE VILLAGE,B057,51300,51433,Plichancourt,51,,,51433000AB0261,,,,,,,,,,,,,0,,,,,S,sols,,,38,4.675776,48.745382
2020-728555,2020-03-07,000002,Vente,2070,6,,RUE DE L AULNE,0070,51300,51433,Plichancourt,51,,,51433000AB0280,,,,,,,,,,,,,0,,,,,S,sols,,,69,4.672749,48.744561
2020-728558,2020-03-07,000002,Vente,3990,,,LA BRUTE,B005,51300,51433,Plichancourt,51,,,51433000AB0278,,,,,,,,,,,,,0,,,,,T,terres,,,8,4.674542,48.745026
2020-728584,2020-03-07,000001,Vente,8000,,,LA GRANDE PRAIRIE,B024,51300,51433,Plichancourt,51,,,51433000ZH0061,,,,,,,,,,,,,0,,,,,P,prés,,,15840,4.662759,48.745825
2020-728634,2020-03-05,000001,Vente,36000,,,LE CHAMP LE PRETRE,B009,51300,51433,Plichancourt,51,,,51433000ZH0129,,,,,,,,,,,,,0,,,,,AB,terrains a bâtir,,,1263,4.671985,48.744388
2020-728817,2020-06-17,000001,Vente,2500,,,LE CRAYON D ADECOURT,B015,51300,51433,Plichancourt,51,,,51433000ZE0083,,,,,,,,,,,,,0,,,,,T,terres,,,3296,4.650838,48.742047
2020-728846,2020-06-17,000001,Echange,600,,,CERF DURAND,B007,51300,51433,Plichancourt,51,,,51433000ZK0011,,,,,,,,,,,,,0,,,,,BT,taillis simples,,,2320,4.676712,48.738805
2020-728846,2020-06-17,000002,Echange,600,,,LE BREUIL,B003,51300,51433,Plichancourt,51,,,514330000A0006,,,,,,,,,,,,,0,,,,,B,bois,,,2486,4.668067,48.748085
2020-728846,2020-06-17,000002,Echange,600,,,LE BREUIL,B003,51300,51433,Plichancourt,51,,,514330000A0237,,,,,,,,,,,,,0,,,,,B,bois,,,1457,4.66823,48.748268
2020-728968,2020-07-08,000001,Vente,14600,,,LA GENILLERE,B022,51300,51433,Plichancourt,51,,,514330000A0169,,,,,,,,,,,,,0,,,,,P,prés,,,5271,4.684204,48.751632
2020-729003,2020-07-31,000001,Vente,800,,,LA SAUSSAIE DE TOURNAY,B050,51300,51433,Plichancourt,51,,,514330000A0149,,,,,,,,,,,,,0,,,,,BT,taillis simples,,,406,4.678891,48.753014
2020-729003,2020-07-31,000001,Vente,800,,,LA SAUSSAIE DE TOURNAY,B050,51300,51433,Plichancourt,51,,,514330000A0152,,,,,,,,,,,,,0,,,,,BP,peupleraies,,,830,4.680607,48.752272
2020-729091,2020-06-26,000001,Echange,4900,,,LE PRE THIERRY,B046,51300,51433,Plichancourt,51,,,514330000C0043,,,,,,,,,,,,,0,,,,,BP,peupleraies,,,3640,4.65819,48.739057
2020-729091,2020-06-26,000001,Echange,4900,,,LE PRE THIERRY,B046,51300,51433,Plichancourt,51,,,514330000C0044,,,,,,,,,,,,,0,,,,,BP,peupleraies,,,3400,4.657091,48.738905
2020-729091,2020-06-26,000001,Echange,4900,,,SEPULTURE,B052,51300,51433,Plichancourt,51,,,514330000C0058,,,,,,,,,,,,,0,,,,,BP,peupleraies,,,6090,4.650706,48.738024
2020-729091,2020-06-26,000001,Echange,4900,,,LA NOUE LA CROISETTE,B032,51300,51433,Plichancourt,51,,,514330000C0160,,,,,,,,,,,,,0,,,,,BP,peupleraies,,,6457,4.657959,48.738608
2020-729113,2020-08-27,000001,Vente,30000,,,LE FOSSE MERLANCON,B021,51300,51433,Plichancourt,51,,,51433000ZH0113,,,,,,,,,,,,,0,,,,,AB,terrains a bâtir,,,950,4.657174,48.7426
2020-729113,2020-08-27,000001,Vente,30000,,,LE FOSSE MERLANCON,B021,51300,51433,Plichancourt,51,,,51433000ZH0116,,,,,,,,,,,,,0,,,,,T,terres,,,1119,4.658077,48.742774
2020-729116,2020-08-29,000002,Vente,130150,14,,RUE DE L AUBEPINE,0080,51300,51433,Plichancourt,51,,,51433000AB0256,,,,,,,,,,,,,0,1,Maison,96,5,S,sols,,,902,4.674876,48.744874
2020-729141,2020-09-08,000001,Vente,58024,,,LA GENILLERE,B022,51300,51433,Plichancourt,51,,,514330000A0168,,,,,,,,,,,,,0,,,,,T,terres,,,5289,4.684475,48.75167
2020-736258,2020-10-24,000002,Vente,150,,,LE VILLAGE,B057,51300,51433,Plichancourt,51,,,51433000AB0282,,,,,,,,,,,,,0,,,,,S,sols,,,5,4.672215,48.745173
2020-736685,2020-10-27,000002,Vente,390,,,LE VILLAGE,B057,51300,51433,Plichancourt,51,,,51433000AB0284,,,,,,,,,,,,,0,,,,,S,sols,,,13,4.672366,48.744911
2020-736700,2020-10-24,000002,Vente,1200,22,,RUE DE L AUBEPINE,0080,51300,51433,Plichancourt,51,,,51433000AB0247,,,,,,,,,,,,,0,,,,,S,sols,,,40,4.67596,48.745377
2020-736701,2020-10-24,000001,Vente,690,14,,RUE DE L AUBEPINE,0080,51300,51433,Plichancourt,51,,,51433000AB0257,,,,,,,,,,,,,0,,,,,S,sols,,,23,4.674698,48.745066
