id_mutation,date_mutation,numero_disposition,nature_mutation,valeur_fonciere,adresse_numero,adresse_suffixe,adresse_nom_voie,adresse_code_voie,code_postal,code_commune,nom_commune,code_departement,ancien_code_commune,ancien_nom_commune,id_parcelle,ancien_id_parcelle,numero_volume,lot1_numero,lot1_surface_carrez,lot2_numero,lot2_surface_carrez,lot3_numero,lot3_surface_carrez,lot4_numero,lot4_surface_carrez,lot5_numero,lot5_surface_carrez,nombre_lots,code_type_local,type_local,surface_reelle_bati,nombre_pieces_principales,code_nature_culture,nature_culture,code_nature_culture_speciale,nature_culture_speciale,surface_terrain,longitude,latitude
2020-727919,2020-06-30,000001,Vente,129240,,,LE MARTREAU,B024,51400,51587,Vadenay,51,,,515870000E0372,,,,,,,,,,,,,0,,,,,BS,taillis sous futaie,,,144,4.392174,49.074139
2020-727919,2020-06-30,000001,Vente,129240,,,CHAITILLON,B006,51400,51587,Vadenay,51,,,515870000F0003,,,,,,,,,,,,,0,,,,,BS,taillis sous futaie,,,1188,4.404428,49.071226
2020-727919,2020-06-30,000001,Vente,129240,,,LES HAUTS PRES,B022,51400,51587,Vadenay,51,,,515870000F0137,,,,,,,,,,,,,0,,,,,BS,taillis sous futaie,,,741,4.410638,49.067476
2020-727919,2020-06-30,000001,Vente,129240,,,LES OILS,B032,51400,51587,Vadenay,51,,,515870000F0407,,,,,,,,,,,,,0,,,,,BS,taillis sous futaie,,,670,4.415189,49.064285
2020-727919,2020-06-30,000001,Vente,129240,,,LES OILS,B032,51400,51587,Vadenay,51,,,515870000F0879,,,,,,,,,,,,,0,,,,,BR,futaies résineuses,PIN,Pins,1330,4.413097,49.063731
2020-727919,2020-06-30,000001,Vente,129240,,,LES HAUTS PRES,B022,51400,51587,Vadenay,51,,,515870000F0896,,,,,,,,,,,,,0,,,,,BS,taillis sous futaie,,,339,4.412311,49.065352
2020-727919,2020-06-30,000001,Vente,129240,,,LA VOIE DE BOUY,B050,51400,51587,Vadenay,51,,,51587000ZM0022,,,,,,,,,,,,,0,,,,,T,terres,,,13571,4.390347,49.076522
2020-727919,2020-06-30,000001,Vente,129240,,,LA VOIE DE BOUY,B050,51400,51587,Vadenay,51,,,51587000ZM0022,,,,,,,,,,,,,0,,,,,T,terres,,,40713,4.390347,49.076522
2020-727919,2020-06-30,000001,Vente,129240,,,LES CARELLES,B004,51400,51587,Vadenay,51,,,51587000ZN0026,,,,,,,,,,,,,0,,,,,T,terres,,,23194,4.403157,49.076086
2020-727919,2020-06-30,000001,Vente,129240,,,LA NOUE DE PONTREUIL,B031,51400,51587,Vadenay,51,,,51587000ZV0006,,,,,,,,,,,,,0,,,,,T,terres,,,22062,4.381763,49.070608
2020-727952,2020-06-29,000001,Vente,66,,,BAYARD,B002,51400,51587,Vadenay,51,,,51587000ZN0197,,,,,,,,,,,,,0,,,,,S,sols,,,44,4.396998,49.074939
2020-727964,2020-06-29,000001,Vente,218000,,,BAYARD,B002,51400,51587,Vadenay,51,,,51587000ZN0055,,,,,,,,,,,,,0,,,,,VE,vergers,,,739,4.397427,49.075179
2020-727964,2020-06-29,000001,Vente,218000,40,,CHE DE VAUX,0050,51400,51587,Vadenay,51,,,51587000ZN0196,,,,,,,,,,,,,0,1,Maison,163,5,S,sols,,,927,4.397159,49.075009
2020-728291,2020-09-16,000001,Vente,30900,,,VAUX,B047,51400,51587,Vadenay,51,,,515870000E0523,,,,,,,,,,,,,0,,,,,BS,taillis sous futaie,,,320,4.400036,49.07225
2020-728291,2020-09-16,000001,Vente,30900,,,VAUX,B047,51400,51587,Vadenay,51,,,51587000ZN0194,,,,,,,,,,,,,0,,,,,VE,vergers,,,2206,4.400392,49.07277
2020-728292,2020-09-16,000001,Vente,231,,,VAUX,B047,51400,51587,Vadenay,51,,,51587000ZN0193,,,,,,,,,,,,,0,,,,,S,sols,,,54,4.400692,49.073122
2020-728292,2020-09-16,000001,Vente,231,,,VAUX,B047,51400,51587,Vadenay,51,,,51587000ZN0195,,,,,,,,,,,,,0,,,,,VE,vergers,,,100,4.400084,49.07241
2020-735808,2020-10-07,000001,Vente,125000,17,,GR GRANDE RUE DE LA NOBLETTE,0040,51400,51587,Vadenay,51,,,515870000E0662,,,,,,,,,,,,,0,1,Maison,147,6,S,sols,,,1095,4.400105,49.07022
2020-735808,2020-10-07,000001,Vente,125000,,,LE VILLAGE,B049,51400,51587,Vadenay,51,,,515870000E1304,,,,,,,,,,,,,0,,,,,VE,vergers,,,217,4.399884,49.070029
2020-736392,2020-10-05,000001,Vente,222000,,,LE VILLAGE,B049,51400,51587,Vadenay,51,,,515870000E0752,,,,,,,,,,,,,0,,,,,VE,vergers,,,240,4.395872,49.074157
2020-736392,2020-10-05,000001,Vente,222000,,,LE VILLAGE,B049,51400,51587,Vadenay,51,,,515870000E0753,,,,,,,,,,,,,0,,,,,S,sols,,,440,4.395881,49.074022
2020-736392,2020-10-05,000001,Vente,222000,,,LE VILLAGE,B049,51400,51587,Vadenay,51,,,515870000E0755,,,,,,,,,,,,,0,,,,,BP,peupleraies,,,90,4.396189,49.074252
2020-736392,2020-10-05,000001,Vente,222000,,,LE VILLAGE,B049,51400,51587,Vadenay,51,,,515870000E1145,,,,,,,,,,,,,0,,,,,T,terres,,,110,4.395798,49.073878
2020-736392,2020-10-05,000001,Vente,222000,,,LE VILLAGE,B049,51400,51587,Vadenay,51,,,515870000E1146,,,,,,,,,,,,,0,,,,,S,sols,,,177,4.395505,49.073963
2020-736392,2020-10-05,000001,Vente,222000,,,LE VILLAGE,B049,51400,51587,Vadenay,51,,,515870000E1147,,,,,,,,,,,,,0,,,,,T,terres,,,300,4.395699,49.073982
2020-736392,2020-10-05,000001,Vente,222000,5039,,RUE DU MARTREAU,0038,51400,51587,Vadenay,51,,,515870000E1152,,,,,,,,,,,,,0,1,Maison,200,7,S,sols,,,240,4.395559,49.07391
2020-736392,2020-10-05,000001,Vente,222000,,,LE VILLAGE,B049,51400,51587,Vadenay,51,,,515870000E1282,,,,,,,,,,,,,0,,,,,S,sols,,,252,4.395633,49.073806
2020-737037,2020-10-29,000001,Vente,37000,,,LE VILLAGE,B049,51400,51587,Vadenay,51,,,515870000E0635,,,,,,,,,,,,,0,,,,,S,sols,,,1462,4.402873,49.069991
2020-737037,2020-10-29,000001,Vente,37000,,,LE VILLAGE,B049,51400,51587,Vadenay,51,,,515870000E0636,,,,,,,,,,,,,0,,,,,BS,taillis sous futaie,,,1578,4.402563,49.069669
2020-737037,2020-10-29,000001,Vente,37000,,,LE VILLAGE,B049,51400,51587,Vadenay,51,,,515870000E0637,,,,,,,,,,,,,0,,,,,T,terres,,,1004,4.402307,49.069905
2020-737037,2020-10-29,000001,Vente,37000,,,LE VILLAGE,B049,51400,51587,Vadenay,51,,,515870000E0638,,,,,,,,,,,,,0,,,,,J,jardins,,,776,4.402668,49.070097
2020-738038,2020-11-13,000001,Vente,200000,54,B,GR GRANDE RUE DE LA NOBLETTE,0040,51400,51587,Vadenay,51,,,515870000E1237,,,,,,,,,,,,,0,1,Maison,176,7,S,sols,,,546,4.395718,49.073609
2020-738038,2020-11-13,000001,Vente,200000,,,LE VILLAGE,B049,51400,51587,Vadenay,51,,,515870000E1241,,,,,,,,,,,,,0,,,,,VE,vergers,,,571,4.396,49.073874
2020-738038,2020-11-13,000001,Vente,200000,,,LE VILLAGE,B049,51400,51587,Vadenay,51,,,515870000E1243,,,,,,,,,,,,,0,,,,,BP,peupleraies,,,505,4.396257,49.074105
2020-739072,2020-12-29,000001,Vente,195000,,,LE VILLAGE,B049,51400,51587,Vadenay,51,,,515870000E1041,,,,,,,,,,,,,0,,,,,J,jardins,,,434,4.395828,49.072847
2020-739072,2020-12-29,000001,Vente,195000,17,,CHE DES POINSONNIERS,0045,51400,51587,Vadenay,51,,,515870000E1245,,,,,,,,,,,,,0,1,Maison,108,4,S,sols,,,997,4.395601,49.072602
