id_mutation,date_mutation,numero_disposition,nature_mutation,valeur_fonciere,adresse_numero,adresse_suffixe,adresse_nom_voie,adresse_code_voie,code_postal,code_commune,nom_commune,code_departement,ancien_code_commune,ancien_nom_commune,id_parcelle,ancien_id_parcelle,numero_volume,lot1_numero,lot1_surface_carrez,lot2_numero,lot2_surface_carrez,lot3_numero,lot3_surface_carrez,lot4_numero,lot4_surface_carrez,lot5_numero,lot5_surface_carrez,nombre_lots,code_type_local,type_local,surface_reelle_bati,nombre_pieces_principales,code_nature_culture,nature_culture,code_nature_culture_speciale,nature_culture_speciale,surface_terrain,longitude,latitude
2020-740498,2020-05-18,000001,Vente,38000,29,,GR GRANDE RUE,0025,52160,52092,Chalancey,52,,,520920000F0013,,,,,,,,,,,,,0,1,Maison,67,3,S,sols,,,465,5.139118,47.676848
2020-740498,2020-05-18,000001,Vente,38000,,,VILLAGE,B092,52160,52092,Chalancey,52,,,520920000F0014,,,,,,,,,,,,,0,,,,,T,terres,,,1023,5.138496,47.67674
2020-740540,2020-05-15,000001,Vente,5000,,,VILLAGE,B092,52160,52092,Chalancey,52,,,520920000F0061,,,,,,,,,,,,,0,,,,,L,landes,,,181,5.142341,47.678532
2020-740540,2020-05-15,000001,Vente,5000,,,VILLAGE,B092,52160,52092,Chalancey,52,,,520920000F0062,,,,,,,,,,,,,0,,,,,S,sols,,,22,5.142362,47.678481
2020-740540,2020-05-15,000001,Vente,5000,,,VILLAGE,B092,52160,52092,Chalancey,52,,,520920000F0063,,,,,,,,,,,,,0,,,,,T,terres,,,1000,5.142408,47.678489
2020-740541,2020-05-15,000002,Vente,100000,,,VILLAGE,B092,52160,52092,Chalancey,52,,,520920000F0058,,,,,,,,,,,,,0,,,,,BT,taillis simples,,,831,5.142481,47.678843
2020-740541,2020-05-15,000002,Vente,100000,,,VILLAGE,B092,52160,52092,Chalancey,52,,,520920000F0059,,,,,,,,,,,,,0,,,,,BT,taillis simples,,,552,5.142186,47.678853
2020-740541,2020-05-15,000002,Vente,100000,3,,RLE DE LA ROCHE,0050,52160,52092,Chalancey,52,,,520920000F0060,,,,,,,,,,,,,0,1,Maison,144,7,S,sols,,,575,5.142258,47.678711
2020-740768,2020-05-28,000001,Vente,55000,12,,RUE DE L AIGUILLON,0005,52160,52092,Chalancey,52,,,520920000F0045,,,,,,,,,,,,,0,1,Maison,108,3,S,sols,,,1027,5.140251,47.678457
2020-740768,2020-05-28,000001,Vente,55000,,,VILLAGE,B092,52160,52092,Chalancey,52,,,520920000F0046,,,,,,,,,,,,,0,,,,,S,sols,,,74,5.14033,47.678659
2020-740768,2020-05-28,000001,Vente,55000,,,VILLAGE,B092,52160,52092,Chalancey,52,,,520920000F0046,,,,,,,,,,,,,0,,,,,T,terres,,,948,5.14033,47.678659
2020-740932,2020-07-13,000001,Echange,2330,,,LES COMMOTTES,B039,52160,52092,Chalancey,52,,,520920000B0202,,,,,,,,,,,,,0,,,,,P,prés,,,9320,5.152946,47.665798
