id_mutation,date_mutation,numero_disposition,nature_mutation,valeur_fonciere,adresse_numero,adresse_suffixe,adresse_nom_voie,adresse_code_voie,code_postal,code_commune,nom_commune,code_departement,ancien_code_commune,ancien_nom_commune,id_parcelle,ancien_id_parcelle,numero_volume,lot1_numero,lot1_surface_carrez,lot2_numero,lot2_surface_carrez,lot3_numero,lot3_surface_carrez,lot4_numero,lot4_surface_carrez,lot5_numero,lot5_surface_carrez,nombre_lots,code_type_local,type_local,surface_reelle_bati,nombre_pieces_principales,code_nature_culture,nature_culture,code_nature_culture_speciale,nature_culture_speciale,surface_terrain,longitude,latitude
2020-740068,2020-02-14,000001,Vente,12300,,,AUX LAVROSSES,B023,52160,52137,Colmier-le-Bas,52,,,52137000ZA0002,,,,,,,,,,,,,0,,,,,T,terres,,,36320,4.927673,47.781021
2020-740068,2020-02-14,000001,Vente,12300,,,AUX LAVROSSES,B023,52160,52137,Colmier-le-Bas,52,,,52137000ZA0004,,,,,,,,,,,,,0,,,,,T,terres,,,24910,4.934316,47.781385
2020-740068,2020-02-14,000001,Vente,12300,,,L HERBUE,B021,52160,52137,Colmier-le-Bas,52,,,52137000ZA0016,,,,,,,,,,,,,0,,,,,L,landes,FRICH,Friche,934,4.944646,47.774555
2020-740068,2020-02-14,000001,Vente,12300,,,L HERBUE,B021,52160,52137,Colmier-le-Bas,52,,,52137000ZA0016,,,,,,,,,,,,,0,,,,,T,terres,,,17981,4.944646,47.774555
2020-740068,2020-02-14,000001,Vente,12300,,,L HERBUE,B021,52160,52137,Colmier-le-Bas,52,,,52137000ZA0016,,,,,,,,,,,,,0,,,,,T,terres,,,71925,4.944646,47.774555
2020-740068,2020-02-14,000001,Vente,12300,,,EN VELONG,B038,52160,52137,Colmier-le-Bas,52,,,52137000ZB0006,,,,,,,,,,,,,0,,,,,T,terres,,,34148,4.943126,47.780908
2020-740068,2020-02-14,000001,Vente,12300,,,EN VELONG,B038,52160,52137,Colmier-le-Bas,52,,,52137000ZB0006,,,,,,,,,,,,,0,,,,,L,landes,FRICH,Friche,13590,4.943126,47.780908
2020-740068,2020-02-14,000001,Vente,12300,,,EN VELONG,B038,52160,52137,Colmier-le-Bas,52,,,52137000ZB0006,,,,,,,,,,,,,0,,,,,T,terres,,,34149,4.943126,47.780908
2020-740068,2020-02-14,000001,Vente,12300,,,EN VELONG,B038,52160,52137,Colmier-le-Bas,52,,,52137000ZB0006,,,,,,,,,,,,,0,,,,,T,terres,,,34148,4.943126,47.780908
2020-740068,2020-02-14,000001,Vente,12300,,,EN VELONG,B038,52160,52137,Colmier-le-Bas,52,,,52137000ZB0006,,,,,,,,,,,,,0,,,,,L,landes,FRICH,Friche,2035,4.943126,47.780908
2020-740068,2020-02-14,000001,Vente,12300,,,PRE LUROT,B030,52160,52137,Colmier-le-Bas,52,,,52137000ZD0009,,,,,,,,,,,,,0,,,,,P,prés,,,7110,4.947253,47.768289
2020-740068,2020-02-14,000001,Vente,12300,,,PRE LUROT,B030,52160,52137,Colmier-le-Bas,52,,,52137000ZD0010,,,,,,,,,,,,,0,,,,,P,prés,,,3250,4.947552,47.768075
2020-740068,2020-02-14,000001,Vente,12300,,,LE VAL DE LIGNE,B036,52160,52137,Colmier-le-Bas,52,,,52137000ZD0039,,,,,,,,,,,,,0,,,,,T,terres,,,3997,4.946391,47.767689
2020-740068,2020-02-14,000001,Vente,12300,,,LE VAL DE LIGNE,B036,52160,52137,Colmier-le-Bas,52,,,52137000ZD0039,,,,,,,,,,,,,0,,,,,BT,taillis simples,,,1003,4.946391,47.767689
2020-740068,2020-02-14,000001,Vente,12300,,,COTE DE BURE,B012,52160,52137,Colmier-le-Bas,52,,,52137000ZE0012,,,,,,,,,,,,,0,,,,,P,prés,,,13120,4.943379,47.766988
2020-740068,2020-02-14,000001,Vente,12300,,,COTE DE BURE,B012,52160,52137,Colmier-le-Bas,52,,,52137000ZE0012,,,,,,,,,,,,,0,,,,,P,prés,,,6560,4.943379,47.766988
