id_mutation,date_mutation,numero_disposition,nature_mutation,valeur_fonciere,adresse_numero,adresse_suffixe,adresse_nom_voie,adresse_code_voie,code_postal,code_commune,nom_commune,code_departement,ancien_code_commune,ancien_nom_commune,id_parcelle,ancien_id_parcelle,numero_volume,lot1_numero,lot1_surface_carrez,lot2_numero,lot2_surface_carrez,lot3_numero,lot3_surface_carrez,lot4_numero,lot4_surface_carrez,lot5_numero,lot5_surface_carrez,nombre_lots,code_type_local,type_local,surface_reelle_bati,nombre_pieces_principales,code_nature_culture,nature_culture,code_nature_culture_speciale,nature_culture_speciale,surface_terrain,longitude,latitude
2020-739740,2020-01-15,000001,Vente,1500,,,VILLAGE,B200,52400,52400,Le Châtelet-sur-Meuse,52,,,524000000B0112,,,,,,,,,,,,,0,,,,,S,sols,,,665,5.630005,47.979337
2020-739740,2020-01-15,000001,Vente,1500,,,VILLAGE,B200,52400,52400,Le Châtelet-sur-Meuse,52,,,524000000B0976,,,,,,,,,,,,,0,,,,,VE,vergers,,,257,5.630106,47.979136
2020-739740,2020-01-15,000001,Vente,1500,25,,RUE MAILLARD,0035,52400,52400,Le Châtelet-sur-Meuse,52,,,524000000B0978,,,,,,,,,,,,,0,1,Maison,105,4,S,sols,,,508,5.629908,47.979184
2020-739740,2020-01-15,000001,Vente,1500,,,CHAMP LE SAINT,B024,52400,52400,Le Châtelet-sur-Meuse,52,,,52400000ZK0023,,,,,,,,,,,,,0,,,,,P,prés,,,20,5.630226,47.979145
2020-739740,2020-01-15,000001,Vente,1500,,,CHAMP LE SAINT,B024,52400,52400,Le Châtelet-sur-Meuse,52,,,52400000ZK0023,,,,,,,,,,,,,0,,,,,P,prés,,,50,5.630226,47.979145
2020-739865,2020-01-21,000001,Vente,140000,,,BEAUCHARMOY,B213,52400,52400,Le Châtelet-sur-Meuse,52,,,524000410A0359,,,,,,,,,,,,,0,,,,,VE,vergers,,,169,5.659398,47.986654
2020-739865,2020-01-21,000001,Vente,140000,1,,RUE PRINCIPALE A BEAUCHARMOY,0046,52400,52400,Le Châtelet-sur-Meuse,52,,,524000410A0360,,,,,,,,,,,,,0,1,Maison,180,8,S,sols,,,943,5.659638,47.986791
2020-739865,2020-01-21,000001,Vente,140000,,,BEAUCHARMOY,B213,52400,52400,Le Châtelet-sur-Meuse,52,,,524000410A0372,,,,,,,,,,,,,0,,,,,J,jardins,,,368,5.659443,47.986267
2020-739865,2020-01-21,000001,Vente,140000,,,BEAUCHARMOY,B213,52400,52400,Le Châtelet-sur-Meuse,52,,,524000410A0372,,,,,,,,,,,,,0,,,,,S,sols,,,7,5.659443,47.986267
2020-739865,2020-01-21,000001,Vente,140000,,,BEAUCHARMOY,B213,52400,52400,Le Châtelet-sur-Meuse,52,,,524000410A0373,,,,,,,,,,,,,0,,,,,S,sols,,,143,5.659448,47.986468
2020-739865,2020-01-21,000001,Vente,140000,6,,RUE PRINCIPALE A BEAUCHARMOY,0046,52400,52400,Le Châtelet-sur-Meuse,52,,,524000410A0927,,,,,,,,,,,,,0,1,Maison,31,2,S,sols,,,246,5.659631,47.986457
2020-739865,2020-01-21,000001,Vente,140000,,,BEAUCHARMOY,B213,52400,52400,Le Châtelet-sur-Meuse,52,,,524000410A0928,,,,,,,,,,,,,0,,,,,S,sols,,,4,5.659782,47.986526
2020-739865,2020-01-21,000001,Vente,140000,,,BEAUCHARMOY,B213,52400,52400,Le Châtelet-sur-Meuse,52,,,524000410A0929,,,,,,,,,,,,,0,,,,,J,jardins,,,599,5.659648,47.986285
2020-739865,2020-01-21,000001,Vente,140000,,,BEAUCHARMOY,B213,52400,52400,Le Châtelet-sur-Meuse,52,,,524000410A0930,,,,,,,,,,,,,0,,,,,J,jardins,,,139,5.659801,47.986319
2020-739865,2020-01-21,000001,Vente,140000,,,VILLAGE,B200,52400,52400,Le Châtelet-sur-Meuse,52,,,524000000B0087,,,,,,,,,,,,,0,,,,,VE,vergers,,,644,5.630578,47.980587
2020-739865,2020-01-21,000001,Vente,140000,5,,RUE MAILLARD,0035,52400,52400,Le Châtelet-sur-Meuse,52,,,524000000B0088,,,,,,,,,,,,,0,1,Maison,123,3,S,sols,,,891,5.629941,47.980638
2020-739866,2020-01-21,000002,Vente,80000,9001,,AU MOULIN A VENT,B101,52400,52400,Le Châtelet-sur-Meuse,52,,,52400000ZP0030,,,,,,,,,,,,,0,1,Maison,22,2,S,sols,,,2565,5.625237,47.975906
2020-739866,2020-01-21,000002,Vente,80000,9001,,AU MOULIN A VENT,B101,52400,52400,Le Châtelet-sur-Meuse,52,,,52400000ZP0030,,,,,,,,,,,,,0,1,Maison,107,4,P,prés,,,10365,5.625237,47.975906
2020-739866,2020-01-21,000002,Vente,80000,9001,,AU MOULIN A VENT,B101,52400,52400,Le Châtelet-sur-Meuse,52,,,52400000ZP0030,,,,,,,,,,,,,0,4,Local industriel. commercial ou assimilé,110,0,P,prés,,,10365,5.625237,47.975906
2020-739866,2020-01-21,000002,Vente,80000,9001,,AU MOULIN A VENT,B101,52400,52400,Le Châtelet-sur-Meuse,52,,,52400000ZP0030,,,,,,,,,,,,,0,1,Maison,22,2,P,prés,,,10365,5.625237,47.975906
2020-739866,2020-01-21,000002,Vente,80000,9001,,AU MOULIN A VENT,B101,52400,52400,Le Châtelet-sur-Meuse,52,,,52400000ZP0030,,,,,,,,,,,,,0,1,Maison,107,4,P,prés,,,10365,5.625237,47.975906
2020-739866,2020-01-21,000002,Vente,80000,9001,,AU MOULIN A VENT,B101,52400,52400,Le Châtelet-sur-Meuse,52,,,52400000ZP0030,,,,,,,,,,,,,0,4,Local industriel. commercial ou assimilé,110,0,P,prés,,,10365,5.625237,47.975906
2020-739866,2020-01-21,000002,Vente,80000,9001,,AU MOULIN A VENT,B101,52400,52400,Le Châtelet-sur-Meuse,52,,,52400000ZP0030,,,,,,,,,,,,,0,1,Maison,22,2,P,prés,,,10365,5.625237,47.975906
2020-739866,2020-01-21,000002,Vente,80000,9001,,AU MOULIN A VENT,B101,52400,52400,Le Châtelet-sur-Meuse,52,,,52400000ZP0030,,,,,,,,,,,,,0,1,Maison,107,4,VE,vergers,,,1096,5.625237,47.975906
2020-739866,2020-01-21,000002,Vente,80000,9001,,AU MOULIN A VENT,B101,52400,52400,Le Châtelet-sur-Meuse,52,,,52400000ZP0030,,,,,,,,,,,,,0,4,Local industriel. commercial ou assimilé,110,0,VE,vergers,,,1096,5.625237,47.975906
2020-739866,2020-01-21,000002,Vente,80000,9001,,AU MOULIN A VENT,B101,52400,52400,Le Châtelet-sur-Meuse,52,,,52400000ZP0030,,,,,,,,,,,,,0,1,Maison,22,2,VE,vergers,,,1096,5.625237,47.975906
2020-739866,2020-01-21,000002,Vente,80000,9001,,AU MOULIN A VENT,B101,52400,52400,Le Châtelet-sur-Meuse,52,,,52400000ZP0030,,,,,,,,,,,,,0,1,Maison,107,4,L,landes,,,735,5.625237,47.975906
2020-739866,2020-01-21,000002,Vente,80000,9001,,AU MOULIN A VENT,B101,52400,52400,Le Châtelet-sur-Meuse,52,,,52400000ZP0030,,,,,,,,,,,,,0,4,Local industriel. commercial ou assimilé,110,0,L,landes,,,735,5.625237,47.975906
2020-739866,2020-01-21,000002,Vente,80000,9001,,AU MOULIN A VENT,B101,52400,52400,Le Châtelet-sur-Meuse,52,,,52400000ZP0030,,,,,,,,,,,,,0,1,Maison,22,2,L,landes,,,735,5.625237,47.975906
2020-739866,2020-01-21,000002,Vente,80000,9001,,AU MOULIN A VENT,B101,52400,52400,Le Châtelet-sur-Meuse,52,,,52400000ZP0030,,,,,,,,,,,,,0,1,Maison,107,4,S,sols,,,2565,5.625237,47.975906
2020-739866,2020-01-21,000002,Vente,80000,9001,,AU MOULIN A VENT,B101,52400,52400,Le Châtelet-sur-Meuse,52,,,52400000ZP0030,,,,,,,,,,,,,0,4,Local industriel. commercial ou assimilé,110,0,S,sols,,,2565,5.625237,47.975906
2020-740323,2020-04-28,000001,Vente,54000,48,,RUE PRINCIPALE A BEAUCHARMOY,0046,52400,52400,Le Châtelet-sur-Meuse,52,,,524000410A0454,,,,,,,,,,,,,0,1,Maison,70,2,S,sols,,,854,5.665805,47.984841
2020-740788,2020-06-29,000001,Vente,56000,,,VILLAGE,B200,52400,52400,Le Châtelet-sur-Meuse,52,,,524000000B0919,,,,,,,,,,,,,0,,,,,J,jardins,,,161,5.629145,47.983639
2020-740788,2020-06-29,000001,Vente,56000,,,VILLAGE,B200,52400,52400,Le Châtelet-sur-Meuse,52,,,524000000B0922,,,,,,,,,,,,,0,,,,,VE,vergers,,,219,5.629346,47.983636
2020-740788,2020-06-29,000001,Vente,56000,16,,RUE D ARAIZE,0005,52400,52400,Le Châtelet-sur-Meuse,52,,,524000000B0998,,,,,,,,,,,,,0,1,Maison,151,4,S,sols,,,382,5.628745,47.983645
2020-741411,2020-09-24,000001,Vente,45000,4,,RUE MAILLOUZE,0037,52400,52400,Le Châtelet-sur-Meuse,52,,,524000000B0075,,,,,,,,,,,,,0,1,Maison,145,4,S,sols,,,500,5.63072,47.981458
2020-741411,2020-09-24,000001,Vente,45000,,,VILLAGE,B200,52400,52400,Le Châtelet-sur-Meuse,52,,,524000000B0076,,,,,,,,,,,,,0,,,,,J,jardins,,,315,5.630668,47.981174
2020-741908,2020-11-18,000001,Vente,25000,26,,RUE D ARAIZE,0005,52400,52400,Le Châtelet-sur-Meuse,52,,,524000000B0019,,,,,,,,,,,,,0,1,Maison,148,5,S,sols,,,725,5.629459,47.984553
2020-742059,2020-11-26,000001,Vente,800,,,VILLAGE,B200,52400,52400,Le Châtelet-sur-Meuse,52,,,524000000B0909,,,,,,,,,,,,,0,,,,,J,jardins,,,759,5.629256,47.980863
2020-742189,2020-12-01,000001,Vente,1000,,,VILLAGE,B200,52400,52400,Le Châtelet-sur-Meuse,52,,,524000000B0170,,,,,,,,,,,,,0,,,,,J,jardins,,,714,5.629047,47.980815
