id_mutation,date_mutation,numero_disposition,nature_mutation,valeur_fonciere,adresse_numero,adresse_suffixe,adresse_nom_voie,adresse_code_voie,code_postal,code_commune,nom_commune,code_departement,ancien_code_commune,ancien_nom_commune,id_parcelle,ancien_id_parcelle,numero_volume,lot1_numero,lot1_surface_carrez,lot2_numero,lot2_surface_carrez,lot3_numero,lot3_surface_carrez,lot4_numero,lot4_surface_carrez,lot5_numero,lot5_surface_carrez,nombre_lots,code_type_local,type_local,surface_reelle_bati,nombre_pieces_principales,code_nature_culture,nature_culture,code_nature_culture_speciale,nature_culture_speciale,surface_terrain,longitude,latitude
2020-743911,2020-01-28,000002,Vente,44500,5123,,LA TEYEE,B739,53110,53235,Sainte-Marie-du-Bois,53,,,53235000ZB0074,,,,,,,,,,,,,0,1,Maison,40,1,S,sols,,,1000,-0.498801,48.468194
2020-743911,2020-01-28,000002,Vente,44500,5123,,LA TEYEE,B739,53110,53235,Sainte-Marie-du-Bois,53,,,53235000ZB0074,,,,,,,,,,,,,0,1,Maison,40,1,J,jardins,,,1332,-0.498801,48.468194
2020-743911,2020-01-28,000002,Vente,44500,,,LA TEYEE,B739,53110,53235,Sainte-Marie-du-Bois,53,,,53235000ZB0076,,,,,,,,,,,,,0,,,,,P,prés,,,136,-0.499098,48.468411
2020-743919,2020-01-18,000002,Vente,4948,12,,RUE DES BLES,0010,53110,53235,Sainte-Marie-du-Bois,53,,,53235000ZN0098,,,,,,,,,,,,,0,,,,,P,prés,,,2474,-0.479603,48.465493
2020-744466,2020-01-23,000001,Vente,115000,10,,LES JOUASSIERES,B514,53110,53235,Sainte-Marie-du-Bois,53,,,53235000ZE0004,,,,,,,,,,,,,0,1,Maison,206,5,S,sols,,,340,-0.488243,48.477583
2020-744466,2020-01-23,000001,Vente,115000,,,LES JOUASSIERES,B514,53110,53235,Sainte-Marie-du-Bois,53,,,53235000ZE0007,,,,,,,,,,,,,0,,,,,S,sols,,,392,-0.488144,48.477885
2020-744466,2020-01-23,000001,Vente,115000,,,LES JOUASSIERES,B514,53110,53235,Sainte-Marie-du-Bois,53,,,53235000ZE0007,,,,,,,,,,,,,0,,,,,AG,terrains d'agrément,PARC,Parc,703,-0.488144,48.477885
2020-744466,2020-01-23,000001,Vente,115000,,,LES JOUASSIERES,B514,53110,53235,Sainte-Marie-du-Bois,53,,,53235000ZE0008,,,,,,,,,,,,,0,,,,,AG,terrains d'agrément,PARC,Parc,1033,-0.487976,48.477671
2020-744466,2020-01-23,000001,Vente,115000,,,LES JOUASSIERES,B514,53110,53235,Sainte-Marie-du-Bois,53,,,53235000ZE0008,,,,,,,,,,,,,0,,,,,S,sols,,,89,-0.487976,48.477671
2020-744777,2020-03-16,000001,Vente,7600,10,,LE MELANFRAY,B538,53110,53235,Sainte-Marie-du-Bois,53,,,53235000ZA0057,,,,,,,,,,,,,0,1,Maison,33,1,S,sols,,,108,-0.500004,48.462416
2020-745016,2020-03-11,000001,Vente,13300,,,LA TRAPPE,B742,53110,53235,Sainte-Marie-du-Bois,53,,,53235000ZM0002,,,,,,,,,,,,,0,,,,,P,prés,,,5050,-0.48646,48.462316
2020-745016,2020-03-11,000001,Vente,13300,,,LA TRAPPE,B742,53110,53235,Sainte-Marie-du-Bois,53,,,53235000ZM0002,,,,,,,,,,,,,0,,,,,E,eaux,ETANG,Etangs,260,-0.48646,48.462316
2020-745016,2020-03-11,000001,Vente,13300,,,LA TRAPPE,B742,53110,53235,Sainte-Marie-du-Bois,53,,,53235000ZM0002,,,,,,,,,,,,,0,,,,,P,prés,,,4100,-0.48646,48.462316
2020-745016,2020-03-11,000001,Vente,13300,,,LA TRAPPE,B742,53110,53235,Sainte-Marie-du-Bois,53,,,53235000ZM0002,,,,,,,,,,,,,0,,,,,P,prés,,,6075,-0.48646,48.462316
2020-745016,2020-03-11,000001,Vente,13300,,,LA TRAPPE,B742,53110,53235,Sainte-Marie-du-Bois,53,,,53235000ZM0006,,,,,,,,,,,,,0,,,,,P,prés,,,6575,-0.484107,48.463038
2020-745016,2020-03-11,000001,Vente,13300,,,LA TRAPPE,B742,53110,53235,Sainte-Marie-du-Bois,53,,,53235000ZM0006,,,,,,,,,,,,,0,,,,,P,prés,,,22250,-0.484107,48.463038
2020-745021,2020-03-09,000003,Vente,87658,,,LE GRAND TAILLIS,B402,53110,53235,Sainte-Marie-du-Bois,53,,,53235000ZM0050,,,,,,,,,,,,,0,,,,,P,prés,,,3203,-0.485386,48.460714
2020-745024,2020-03-17,000001,Vente,94910,1,,LA TRAPPE,B742,53110,53235,Sainte-Marie-du-Bois,53,,,53235000ZM0003,,,,,,,,,,,,,0,1,Maison,138,6,S,sols,,,578,-0.486804,48.462114
2020-745734,2020-05-27,000001,Vente,167000,36,,RUE JACQUES FRANCOIS DUJARIE,0019,53110,53235,Sainte-Marie-du-Bois,53,,,53235000ZN0026,,,,,,,,,,,,,0,1,Maison,77,2,J,jardins,,,4047,-0.479471,48.466204
2020-745734,2020-05-27,000001,Vente,167000,36,,RUE JACQUES FRANCOIS DUJARIE,0019,53110,53235,Sainte-Marie-du-Bois,53,,,53235000ZN0026,,,,,,,,,,,,,0,1,Maison,77,2,S,sols,,,500,-0.479471,48.466204
2020-746953,2020-07-17,000001,Vente,221000,4,,LA PESCHELIERE,B565,53110,53235,Sainte-Marie-du-Bois,53,,,53235000ZE0032,,,,,,,,,,,,,0,1,Maison,140,2,P,prés,,,22102,,
2020-746953,2020-07-17,000001,Vente,221000,4,,LA PESCHELIERE,B565,53110,53235,Sainte-Marie-du-Bois,53,,,53235000ZE0032,,,,,,,,,,,,,0,1,Maison,140,2,S,sols,,,700,,
2020-746953,2020-07-17,000001,Vente,221000,4,,LA PESCHELIERE,B565,53110,53235,Sainte-Marie-du-Bois,53,,,53235000ZE0032,,,,,,,,,,,,,0,1,Maison,140,2,J,jardins,,,1250,,
2020-746953,2020-07-17,000001,Vente,221000,4,,LA PESCHELIERE,B565,53110,53235,Sainte-Marie-du-Bois,53,,,53235000ZE0032,,,,,,,,,,,,,0,1,Maison,140,2,T,terres,,,6408,,
2020-747494,2020-07-30,000001,Vente,34500,,,LA CLOUE,B304,53110,53235,Sainte-Marie-du-Bois,53,,,53235000ZL0024,,,,,,,,,,,,,0,,,,,P,prés,,,44120,-0.470869,48.455146
2020-747494,2020-07-30,000001,Vente,34500,,,LA CLOUE,B304,53110,53235,Sainte-Marie-du-Bois,53,,,53235000ZL0024,,,,,,,,,,,,,0,,,,,BT,taillis simples,,,18600,-0.470869,48.455146
2020-747667,2020-08-21,000001,Vente,15000,21,,CHE DES PRES,0040,53110,53235,Sainte-Marie-du-Bois,53,,,532350000D0021,,,,,,,,,,,,,0,1,Maison,25,1,S,sols,,,131,-0.481178,48.466126
2020-747667,2020-08-21,000001,Vente,15000,,,LE BOURG,B036,53110,53235,Sainte-Marie-du-Bois,53,,,532350000D0025,,,,,,,,,,,,,0,,,,,J,jardins,,,252,-0.481329,48.465945
2020-747691,2020-08-28,000001,Vente,25000,,,LES FONTAINES,B338,53110,53235,Sainte-Marie-du-Bois,53,,,53235000ZE0069,,,,,,,,,,,,,0,,,,,S,sols,,,140,-0.489074,48.474609
2020-747691,2020-08-28,000001,Vente,25000,6,,LES FONTAINES,B338,53110,53235,Sainte-Marie-du-Bois,53,,,53235000ZE0099,,,,,,,,,,,,,0,1,Maison,48,1,S,sols,,,500,-0.489122,48.474746
2020-747691,2020-08-28,000001,Vente,25000,6,,LES FONTAINES,B338,53110,53235,Sainte-Marie-du-Bois,53,,,53235000ZE0099,,,,,,,,,,,,,0,1,Maison,48,1,P,prés,,,2423,-0.489122,48.474746
2020-748053,2020-09-16,000001,Vente,7700,,,LE MELANFRAY,B538,53110,53235,Sainte-Marie-du-Bois,53,,,53235000ZA0124,,,,,,,,,,,,,0,,,,,T,terres,,,1661,-0.501776,48.462674
2020-748053,2020-09-16,000001,Vente,7700,,,LE MELANFRAY,B538,53110,53235,Sainte-Marie-du-Bois,53,,,53235000ZA0124,,,,,,,,,,,,,0,,,,,S,sols,,,41,-0.501776,48.462674
2020-748822,2020-10-08,000001,Vente,11150,2,,LA GUYONNIERE,B436,53110,53235,Sainte-Marie-du-Bois,53,,,53235000ZC0048,,,,,,,,,,,,,0,1,Maison,32,1,S,sols,,,370,-0.505747,48.471258
2020-748822,2020-10-08,000001,Vente,11150,2,,LA GUYONNIERE,B436,53110,53235,Sainte-Marie-du-Bois,53,,,53235000ZC0048,,,,,,,,,,,,,0,1,Maison,32,1,J,jardins,,,1010,-0.505747,48.471258
2020-749441,2020-10-26,000001,Vente,55000,6,,RUE DE LA FORGE,0018,53110,53235,Sainte-Marie-du-Bois,53,,,532350000D0066,,,,,,,,,,,,,0,1,Maison,120,4,S,sols,,,724,-0.481364,48.465411
2020-749862,2020-11-13,000001,Vente,60000,5,,LOT DES CAMELIAS,A015,53110,53235,Sainte-Marie-du-Bois,53,,,53235000ZN0099,,,,,,,,,,,,,0,,,,,S,sols,,,22,-0.478898,48.466534
2020-749862,2020-11-13,000001,Vente,60000,8,,LOT DES CAMELIAS,A015,53110,53235,Sainte-Marie-du-Bois,53,,,53235000ZN0101,,,,,,,,,,,,,0,1,Maison,69,3,S,sols,,,542,-0.478782,48.466427
2020-750137,2020-12-10,000001,Vente,16300,4,,LA MAISON NEUVE,B530,53110,53235,Sainte-Marie-du-Bois,53,,,53235000ZA0121,,,,,,,,,,,,,0,1,Maison,105,5,P,prés,,,5193,-0.511673,48.461029
2020-750137,2020-12-10,000001,Vente,16300,4,,LA MAISON NEUVE,B530,53110,53235,Sainte-Marie-du-Bois,53,,,53235000ZA0121,,,,,,,,,,,,,0,1,Maison,105,5,S,sols,,,1040,-0.511673,48.461029
