id_mutation,date_mutation,numero_disposition,nature_mutation,valeur_fonciere,adresse_numero,adresse_suffixe,adresse_nom_voie,adresse_code_voie,code_postal,code_commune,nom_commune,code_departement,ancien_code_commune,ancien_nom_commune,id_parcelle,ancien_id_parcelle,numero_volume,lot1_numero,lot1_surface_carrez,lot2_numero,lot2_surface_carrez,lot3_numero,lot3_surface_carrez,lot4_numero,lot4_surface_carrez,lot5_numero,lot5_surface_carrez,nombre_lots,code_type_local,type_local,surface_reelle_bati,nombre_pieces_principales,code_nature_culture,nature_culture,code_nature_culture_speciale,nature_culture_speciale,surface_terrain,longitude,latitude
2020-743582,2020-01-08,000001,Vente,109000,4,,RUE DU POURTOUR,0047,53800,53253,Saint-Saturnin-du-Limet,53,,,532530000C0147,,,,,,,,,,,,,0,1,Maison,175,7,S,sols,,,228,-1.068566,47.811821
2020-743582,2020-01-08,000001,Vente,109000,,,RUE DU POURTOUR,0047,53800,53253,Saint-Saturnin-du-Limet,53,,,532530000C0268,,,,,,,,,,,,,0,,,,,J,jardins,,,588,-1.068393,47.811525
2020-743582,2020-01-08,000001,Vente,109000,,,RUE DU POURTOUR,0047,53800,53253,Saint-Saturnin-du-Limet,53,,,532530000C0299,,,,,,,,,,,,,0,,,,,S,sols,,,18,-1.068223,47.811654
2020-743582,2020-01-08,000001,Vente,109000,,,RUE DU POURTOUR,0047,53800,53253,Saint-Saturnin-du-Limet,53,,,532530000C0301,,,,,,,,,,,,,0,,,,,S,sols,,,8,-1.068284,47.811659
2020-743793,2020-01-27,000001,Vente,50000,12,,RUE PRINCIPALE,0050,53800,53253,Saint-Saturnin-du-Limet,53,,,532530000C0278,,,,,,,,,,,,,0,1,Maison,125,7,S,sols,,,820,-1.066946,47.812017
2020-744896,2020-03-03,000001,Vente,120000,5173,,CHE DU PRESBYTERE,0049,53800,53253,Saint-Saturnin-du-Limet,53,,,532530000C0252,,,,,,,,,,,,,0,1,Maison,108,6,VE,vergers,POMME,Pommiers,1408,-1.067232,47.810807
2020-744896,2020-03-03,000001,Vente,120000,5173,,CHE DU PRESBYTERE,0049,53800,53253,Saint-Saturnin-du-Limet,53,,,532530000C0252,,,,,,,,,,,,,0,1,Maison,108,6,S,sols,,,500,-1.067232,47.810807
2020-745211,2020-04-23,000001,Vente,110000,19,,RUE PRINCIPALE,0050,53800,53253,Saint-Saturnin-du-Limet,53,,,532530000C0161,,,,,,,,,,,,,0,4,Local industriel. commercial ou assimilé,568,0,S,sols,,,665,-1.069212,47.811936
2020-745534,2020-04-30,000002,Vente,24000,,,LES HUNAUDIERES,B132,53800,53253,Saint-Saturnin-du-Limet,53,,,53253000ZI0190,,,,,,,,,,,,,0,,,,,T,terres,,,574,-1.065219,47.805593
2020-745534,2020-04-30,000002,Vente,24000,,,LES HUNAUDIERES,B132,53800,53253,Saint-Saturnin-du-Limet,53,,,53253000ZI0192,,,,,,,,,,,,,0,,,,,J,jardins,,,66,-1.065103,47.806162
2020-748165,2020-09-02,000001,Vente,160000,1,,ROCHE POULAIN,B329,53800,53253,Saint-Saturnin-du-Limet,53,,,53253000ZK0032,,,,,,,,,,,,,0,3,Dépendance,,0,J,jardins,,,819,-1.049179,47.800584
2020-748165,2020-09-02,000001,Vente,160000,1,,ROCHE POULAIN,B329,53800,53253,Saint-Saturnin-du-Limet,53,,,53253000ZK0032,,,,,,,,,,,,,0,2,Appartement,56,2,J,jardins,,,819,-1.049179,47.800584
2020-748165,2020-09-02,000001,Vente,160000,1,,ROCHE POULAIN,B329,53800,53253,Saint-Saturnin-du-Limet,53,,,53253000ZK0032,,,,,,,,,,,,,0,2,Appartement,56,2,S,sols,,,380,-1.049179,47.800584
2020-748165,2020-09-02,000001,Vente,160000,1,,ROCHE POULAIN,B329,53800,53253,Saint-Saturnin-du-Limet,53,,,53253000ZK0032,,,,,,,,,,,,,0,2,Appartement,114,6,S,sols,,,380,-1.049179,47.800584
2020-748165,2020-09-02,000001,Vente,160000,1,,ROCHE POULAIN,B329,53800,53253,Saint-Saturnin-du-Limet,53,,,53253000ZK0032,,,,,,,,,,,,,0,3,Dépendance,,0,S,sols,,,380,-1.049179,47.800584
2020-748165,2020-09-02,000001,Vente,160000,1,,ROCHE POULAIN,B329,53800,53253,Saint-Saturnin-du-Limet,53,,,53253000ZK0032,,,,,,,,,,,,,0,2,Appartement,114,6,J,jardins,,,819,-1.049179,47.800584
2020-748165,2020-09-02,000001,Vente,160000,1,,ROCHE POULAIN,B329,53800,53253,Saint-Saturnin-du-Limet,53,,,53253000ZK0032,,,,,,,,,,,,,0,2,Appartement,56,2,J,jardins,,,819,-1.049179,47.800584
2020-748165,2020-09-02,000001,Vente,160000,1,,ROCHE POULAIN,B329,53800,53253,Saint-Saturnin-du-Limet,53,,,53253000ZK0032,,,,,,,,,,,,,0,3,Dépendance,,0,S,sols,,,380,-1.049179,47.800584
2020-748165,2020-09-02,000001,Vente,160000,1,,ROCHE POULAIN,B329,53800,53253,Saint-Saturnin-du-Limet,53,,,53253000ZK0032,,,,,,,,,,,,,0,2,Appartement,56,2,S,sols,,,380,-1.049179,47.800584
2020-748165,2020-09-02,000001,Vente,160000,1,,ROCHE POULAIN,B329,53800,53253,Saint-Saturnin-du-Limet,53,,,53253000ZK0032,,,,,,,,,,,,,0,3,Dépendance,,0,J,jardins,,,819,-1.049179,47.800584
2020-748343,2020-09-23,000001,Vente,47000,5,,RTE DE LA CRUE,0020,53800,53253,Saint-Saturnin-du-Limet,53,,,532530000C0125,,,,,,,,,,,,,0,1,Maison,88,4,J,jardins,,,1514,-1.065404,47.812139
2020-748343,2020-09-23,000001,Vente,47000,5,,RTE DE LA CRUE,0020,53800,53253,Saint-Saturnin-du-Limet,53,,,532530000C0125,,,,,,,,,,,,,0,1,Maison,88,4,S,sols,,,354,-1.065404,47.812139
2020-748343,2020-09-23,000001,Vente,47000,,,RTE DE LA CRUE,0020,53800,53253,Saint-Saturnin-du-Limet,53,,,532530000C0266,,,,,,,,,,,,,0,,,,,J,jardins,,,258,-1.064929,47.812265
2020-749284,2020-10-12,000001,Vente,2500,,,LA RIVIERE,B292,53800,53253,Saint-Saturnin-du-Limet,53,,,53253000ZL0065,,,,,,,,,,,,,0,,,,,S,sols,,,675,-1.084119,47.808637
2020-749511,2020-10-26,000001,Vente,98900,,,CHE DU PRESBYTERE,0049,53800,53253,Saint-Saturnin-du-Limet,53,,,532530000C0137,,,,,,,,,,,,,0,,,,,J,jardins,,,807,-1.067994,47.811017
2020-749511,2020-10-26,000001,Vente,98900,2,,CHE DU PRESBYTERE,0049,53800,53253,Saint-Saturnin-du-Limet,53,,,532530000C0138,,,,,,,,,,,,,0,1,Maison,72,5,S,sols,,,125,-1.067863,47.811202
2020-750606,2020-12-22,000001,Vente,8494,,,LA GUILLETIERE,B124,53800,53253,Saint-Saturnin-du-Limet,53,,,53253000ZA0001,,,,,,,,,,,,,0,,,,,T,terres,,,11917,-1.134839,47.825803
2020-750606,2020-12-22,000001,Vente,8494,,,LA GUILLETIERE,B124,53800,53253,Saint-Saturnin-du-Limet,53,,,53253000ZA0002,,,,,,,,,,,,,0,,,,,P,prés,,,779,-1.133693,47.825661
2020-750606,2020-12-22,000001,Vente,8494,,,LA GUILLETIERE,B124,53800,53253,Saint-Saturnin-du-Limet,53,,,53253000ZA0003,,,,,,,,,,,,,0,,,,,T,terres,,,6180,-1.133305,47.825666
2020-750616,2020-12-22,000001,Vente,13660,,,LA GUILLETIERE,B124,53800,53253,Saint-Saturnin-du-Limet,53,,,53253000ZA0004,,,,,,,,,,,,,0,,,,,P,prés,,,6880,-1.134222,47.82669
2020-750616,2020-12-22,000001,Vente,13660,,,LA GUILLETIERE,B124,53800,53253,Saint-Saturnin-du-Limet,53,,,53253000ZA0004,,,,,,,,,,,,,0,,,,,P,prés,,,3845,-1.134222,47.82669
2020-750927,2020-12-29,000002,Vente,37000,23,,RUE PRINCIPALE,0050,53800,53253,Saint-Saturnin-du-Limet,53,,,532530000C0305,,,,,,,,,,,,,0,4,Local industriel. commercial ou assimilé,187,0,,,,,,-1.069672,47.812006
