id_mutation,date_mutation,numero_disposition,nature_mutation,valeur_fonciere,adresse_numero,adresse_suffixe,adresse_nom_voie,adresse_code_voie,code_postal,code_commune,nom_commune,code_departement,ancien_code_commune,ancien_nom_commune,id_parcelle,ancien_id_parcelle,numero_volume,lot1_numero,lot1_surface_carrez,lot2_numero,lot2_surface_carrez,lot3_numero,lot3_surface_carrez,lot4_numero,lot4_surface_carrez,lot5_numero,lot5_surface_carrez,nombre_lots,code_type_local,type_local,surface_reelle_bati,nombre_pieces_principales,code_nature_culture,nature_culture,code_nature_culture_speciale,nature_culture_speciale,surface_terrain,longitude,latitude
2020-760254,2020-01-06,000001,Vente,57780,,,AUX PAQUIS,B086,54620,54067,Beuveille,54,,,54067000AB0759,,,,,,,,,,,,,0,,,,,AB,terrains a bâtir,,,642,5.691159,49.434637
2020-760395,2020-02-03,000001,Vente,120000,8,B,RUE DE LA RESISTANCE,0325,54620,54067,Beuveille,54,,,54067000AB0540,,,,,,,,,,,,,0,1,Maison,100,3,S,sols,,,82,5.691468,49.432323
2020-760395,2020-02-03,000001,Vente,120000,,,LE VLG,B119,54620,54067,Beuveille,54,,,54067000AB0543,,,,,,,,,,,,,0,,,,,J,jardins,,,204,5.6915,49.432174
2020-760489,2020-01-29,000001,Vente,95000,10,,RUE JEAN MOULIN,0215,54620,54067,Beuveille,54,,,54067000AB0042,,,,,,,,,,,,,0,1,Maison,76,4,S,sols,,,73,5.689968,49.432988
2020-760834,2020-03-17,000001,Vente,35211,,,BOUT DE LA PRELE,B007,54620,54067,Beuveille,54,,,540670000Y0213,,,,,,,,,,,,,0,,,,,P,prés,,,32460,5.704534,49.429612
2020-760834,2020-03-17,000001,Vente,35211,,,BOUT DE LA PRELE,B007,54620,54067,Beuveille,54,,,540670000Y0214,,,,,,,,,,,,,0,,,,,P,prés,,,10120,5.703054,49.429341
2020-760834,2020-03-17,000001,Vente,35211,,,BOUT DE LA PRELE,B007,54620,54067,Beuveille,54,,,540670000Y0276,,,,,,,,,,,,,0,,,,,P,prés,,,13400,5.706268,49.429443
2020-761115,2020-05-22,000001,Vente,179000,4,,RUE JEAN CHARCOT,0201,54620,54067,Beuveille,54,,,54067000AB0387,,,,,,,,,,,,,0,1,Maison,78,5,S,sols,,,482,5.688435,49.434205
2020-761115,2020-05-22,000001,Vente,179000,,,AUX PAQUIS,B086,54620,54067,Beuveille,54,,,54067000AB0434,,,,,,,,,,,,,0,,,,,S,sols,,,145,5.685663,49.434798
2020-761115,2020-05-22,000001,Vente,179000,,,AUX PAQUIS,B086,54620,54067,Beuveille,54,,,54067000AB0435,,,,,,,,,,,,,0,,,,,S,sols,,,3435,5.687279,49.434415
2020-761115,2020-05-22,000001,Vente,179000,,,AUX PAQUIS,B086,54620,54067,Beuveille,54,,,54067000AB0440,,,,,,,,,,,,,0,,,,,L,landes,FRICH,Friche,595,5.686529,49.434829
2020-761319,2020-05-22,000001,Vente,145000,,,CHICORY,B019,54620,54067,Beuveille,54,,,54067000AB0170,,,1,123.42,5,,,,,,,,2,2,Appartement,135,4,,,,,,5.689928,49.43085
2020-761475,2020-06-11,000001,Vente,22398,,,HOUDIONVAUX SUR CALVERT,B069,54620,54067,Beuveille,54,,,540670000X0158,,,,,,,,,,,,,0,,,,,T,terres,,,37330,5.684725,49.444182
2020-761732,2020-06-30,000001,Vente,216000,,,LE VLG,B119,54620,54067,Beuveille,54,,,54067000AB0632,,,,,,,,,,,,,0,,,,,J,jardins,,,9,5.690899,49.432
2020-761732,2020-06-30,000001,Vente,216000,4,,RUE DE LA RESISTANCE,0325,54620,54067,Beuveille,54,,,54067000AB0633,,,,,,,,,,,,,0,1,Maison,165,4,S,sols,,,321,5.690965,49.431979
2020-761922,2020-08-07,000001,Vente,290000,5,,RUE DU 19 MARS 1962,0250,54620,54067,Beuveille,54,,,54067000AB0588,,,,,,,,,,,,,0,1,Maison,178,7,J,jardins,,,356,5.684503,49.436256
2020-761922,2020-08-07,000001,Vente,290000,5,,RUE DU 19 MARS 1962,0250,54620,54067,Beuveille,54,,,54067000AB0588,,,,,,,,,,,,,0,1,Maison,178,7,S,sols,,,500,5.684503,49.436256
2020-762196,2020-08-27,000001,Vente,100000,19,,RUE DU 19 MARS 1962,0250,54620,54067,Beuveille,54,,,54067000AB0654,,,,,,,,,,,,,0,1,Maison,106,5,S,sols,,,853,5.686705,49.436547
2020-762394,2020-09-22,000001,Vente,132000,22,,RUE JEAN MOULIN,0215,54620,54067,Beuveille,54,,,54067000AB0030,,,,,,,,,,,,,0,3,Dépendance,,0,S,sols,,,295,5.692015,49.43349
2020-762394,2020-09-22,000001,Vente,132000,22,,RUE JEAN MOULIN,0215,54620,54067,Beuveille,54,,,54067000AB0030,,,,,,,,,,,,,0,1,Maison,75,3,S,sols,,,295,5.692015,49.43349
2020-762635,2020-10-07,000001,Vente,725332,,,GD FOND DE FAVE,B060,54620,54067,Beuveille,54,,,540670000X0013,,,,,,,,,,,,,0,,,,,T,terres,,,40515,5.659542,49.436572
2020-762635,2020-10-07,000001,Vente,725332,,,LA CROISETTE,B021,54620,54067,Beuveille,54,,,540670000X0020,,,,,,,,,,,,,0,,,,,T,terres,,,4400,5.661987,49.437982
2020-762635,2020-10-07,000001,Vente,725332,,,DAMANEL,B025,54620,54067,Beuveille,54,,,540670000X0061,,,,,,,,,,,,,0,,,,,T,terres,,,19380,5.673819,49.438951
2020-762635,2020-10-07,000001,Vente,725332,,,DAMANEL,B025,54620,54067,Beuveille,54,,,540670000X0061,,,,,,,,,,,,,0,,,,,L,landes,FRICH,Friche,3550,5.673819,49.438951
2020-762635,2020-10-07,000001,Vente,725332,,,SUR LE CHEMIN DU BOIS COUC,B016,54620,54067,Beuveille,54,,,540670000X0068,,,,,,,,,,,,,0,,,,,T,terres,,,20540,5.676295,49.439402
2020-762635,2020-10-07,000001,Vente,725332,,,LE BUAT,B011,54620,54067,Beuveille,54,,,540670000X0141,,,,,,,,,,,,,0,,,,,P,prés,,,33150,5.68205,49.445014
2020-762635,2020-10-07,000001,Vente,725332,,,LE BUAT,B011,54620,54067,Beuveille,54,,,540670000X0142,,,,,,,,,,,,,0,,,,,P,prés,,,6750,5.680735,49.445616
2020-762635,2020-10-07,000001,Vente,725332,,,LE BUAT,B011,54620,54067,Beuveille,54,,,540670000X0142,,,,,,,,,,,,,0,,,,,P,prés,,,41860,5.680735,49.445616
2020-762635,2020-10-07,000001,Vente,725332,,,ENTRE LES DEUX HOUDIONVAUX,B046,54620,54067,Beuveille,54,,,540670000X0151,,,,,,,,,,,,,0,,,,,T,terres,,,39990,5.684836,49.44839
2020-762635,2020-10-07,000001,Vente,725332,,,ENTRE LES DEUX HOUDIONVAUX,B046,54620,54067,Beuveille,54,,,540670000X0151,,,,,,,,,,,,,0,,,,,T,terres,,,2570,5.684836,49.44839
2020-762635,2020-10-07,000001,Vente,725332,,,LA CROISETTE,B021,54620,54067,Beuveille,54,,,540670000X0201,,,,,,,,,,,,,0,,,,,P,prés,,,9240,5.662699,49.437865
2020-762635,2020-10-07,000001,Vente,725332,,,LA CROISETTE,B021,54620,54067,Beuveille,54,,,540670000X0201,,,,,,,,,,,,,0,,,,,T,terres,,,10620,5.662699,49.437865
2020-762635,2020-10-07,000001,Vente,725332,,,LA CROISETTE,B021,54620,54067,Beuveille,54,,,540670000X0220,,,,,,,,,,,,,0,,,,,T,terres,,,36230,5.662194,49.436179
2020-762635,2020-10-07,000001,Vente,725332,,,PRE COLSON,B094,54620,54067,Beuveille,54,,,540670000X0352,,,,,,,,,,,,,0,,,,,P,prés,,,10959,5.689034,49.436815
2020-762635,2020-10-07,000001,Vente,725332,,,DEVANT FALOISE,B028,54620,54067,Beuveille,54,,,540670000Y0009,,,,,,,,,,,,,0,,,,,T,terres,,,33545,5.655177,49.435617
2020-762635,2020-10-07,000001,Vente,725332,,,CHP GRAND MERE,B020,54620,54067,Beuveille,54,,,540670000Y0042,,,,,,,,,,,,,0,,,,,T,terres,,,6570,5.657721,49.42969
2020-762635,2020-10-07,000001,Vente,725332,,,LES SARRAZINS,B105,54620,54067,Beuveille,54,,,540670000Y0048,,,,,,,,,,,,,0,,,,,P,prés,,,14635,5.667162,49.43496
2020-762635,2020-10-07,000001,Vente,725332,,,LES SARRAZINS,B105,54620,54067,Beuveille,54,,,540670000Y0048,,,,,,,,,,,,,0,,,,,T,terres,,,14635,5.667162,49.43496
2020-762635,2020-10-07,000001,Vente,725332,,,BOUT DE LA VOIRPELIERE,B008,54620,54067,Beuveille,54,,,540670000Y0056,,,,,,,,,,,,,0,,,,,T,terres,,,41490,5.673194,49.431231
2020-762635,2020-10-07,000001,Vente,725332,,,AUX SAULES,B106,54620,54067,Beuveille,54,,,540670000Y0066,,,,,,,,,,,,,0,,,,,P,prés,,,12550,5.681568,49.42903
2020-762635,2020-10-07,000001,Vente,725332,,,FOND DE LALONVEAU,B054,54620,54067,Beuveille,54,,,540670000Y0078,,,,,,,,,,,,,0,,,,,T,terres,,,16880,5.670955,49.426378
2020-762635,2020-10-07,000001,Vente,725332,,,FOND DE LALONVEAU,B054,54620,54067,Beuveille,54,,,540670000Y0083,,,,,,,,,,,,,0,,,,,T,terres,,,8680,5.667628,49.425571
2020-762635,2020-10-07,000001,Vente,725332,,,LES RAUSELS,B102,54620,54067,Beuveille,54,,,540670000Y0099,,,,,,,,,,,,,0,,,,,T,terres,,,17320,5.675847,49.422691
2020-762635,2020-10-07,000001,Vente,725332,,,FOSSE AUX CAILLOUX,B059,54620,54067,Beuveille,54,,,540670000Y0108,,,,,,,,,,,,,0,,,,,T,terres,,,9345,5.684001,49.419871
2020-762635,2020-10-07,000001,Vente,725332,,,ENTRE RAUSELS ET FOSSE CAI,B047,54620,54067,Beuveille,54,,,540670000Y0112,,,,,,,,,,,,,0,,,,,T,terres,,,19420,5.678438,49.421223
2020-762635,2020-10-07,000001,Vente,725332,,,LA HOUMELANDE,B070,54620,54067,Beuveille,54,,,540670000Y0122,,,,,,,,,,,,,0,,,,,P,prés,,,54405,5.687211,49.422946
2020-762635,2020-10-07,000001,Vente,725332,,,LA HOUMELANDE,B070,54620,54067,Beuveille,54,,,540670000Y0123,,,,,,,,,,,,,0,,,,,P,prés,,,17155,5.687727,49.422341
2020-762635,2020-10-07,000001,Vente,725332,,,LA HOUMELANDE,B070,54620,54067,Beuveille,54,,,540670000Y0123,,,,,,,,,,,,,0,,,,,T,terres,,,17155,5.687727,49.422341
2020-762635,2020-10-07,000001,Vente,725332,,,LA HOUMELANDE,B070,54620,54067,Beuveille,54,,,540670000Y0124,,,,,,,,,,,,,0,,,,,T,terres,,,20715,5.688564,49.422003
2020-762635,2020-10-07,000001,Vente,725332,,,LA HOUMELANDE,B070,54620,54067,Beuveille,54,,,540670000Y0124,,,,,,,,,,,,,0,,,,,T,terres,,,20715,5.688564,49.422003
2020-762635,2020-10-07,000001,Vente,725332,,,LA HOUMELANDE,B070,54620,54067,Beuveille,54,,,540670000Y0125,,,,,,,,,,,,,0,,,,,T,terres,,,27840,5.688446,49.42087
2020-762635,2020-10-07,000001,Vente,725332,,,BITARDE,B003,54620,54067,Beuveille,54,,,540670000Y0133,,,,,,,,,,,,,0,,,,,T,terres,,,22305,5.688945,49.425867
2020-762635,2020-10-07,000001,Vente,725332,,,HT DE BASLIEUX,B073,54620,54067,Beuveille,54,,,540670000Y0195,,,,,,,,,,,,,0,,,,,P,prés,,,58755,5.705512,49.431227
2020-762635,2020-10-07,000001,Vente,725332,,,LES RAUSELS,B102,54620,54067,Beuveille,54,,,540670000Y0210,,,,,,,,,,,,,0,,,,,P,prés,,,34785,5.677008,49.423413
2020-762635,2020-10-07,000001,Vente,725332,,,LES RAUSELS,B102,54620,54067,Beuveille,54,,,540670000Y0210,,,,,,,,,,,,,0,,,,,T,terres,,,20000,5.677008,49.423413
2020-762635,2020-10-07,000001,Vente,725332,,,LES RAUSELS,B102,54620,54067,Beuveille,54,,,540670000Y0211,,,,,,,,,,,,,0,,,,,P,prés,,,28530,5.679497,49.424704
2020-762635,2020-10-07,000001,Vente,725332,,,LES RAUSELS,B102,54620,54067,Beuveille,54,,,540670000Y0211,,,,,,,,,,,,,0,,,,,P,prés,,,28530,5.679497,49.424704
2020-762635,2020-10-07,000001,Vente,725332,,,AU DSU DU PONT DE XARNE,B041,54620,54067,Beuveille,54,,,540670000Y0235,,,,,,,,,,,,,0,,,,,T,terres,,,20740,5.670952,49.423169
2020-762635,2020-10-07,000001,Vente,725332,,,MARCHOME,B081,54620,54067,Beuveille,54,,,540670000Y0254,,,,,,,,,,,,,0,,,,,T,terres,,,21380,5.672472,49.423662
2020-762635,2020-10-07,000001,Vente,725332,,,MARCHOME,B081,54620,54067,Beuveille,54,,,540670000Y0352,,,,,,,,,,,,,0,,,,,P,prés,,,60000,5.675315,49.426377
2020-762635,2020-10-07,000001,Vente,725332,,,MARCHOME,B081,54620,54067,Beuveille,54,,,540670000Y0352,,,,,,,,,,,,,0,,,,,T,terres,,,173487,5.675315,49.426377
2020-762659,2020-10-08,000001,Vente,125000,14,,RUE JEAN MOULIN,0215,54620,54067,Beuveille,54,,,54067000AB0034,,,,,,,,,,,,,0,1,Maison,137,5,S,sols,,,100,5.691474,49.433304
2020-762659,2020-10-08,000001,Vente,125000,,,LE VLG,B119,54620,54067,Beuveille,54,,,54067000AB0329,,,,,,,,,,,,,0,,,,,S,sols,,,41,5.691437,49.43339
2020-762659,2020-10-08,000001,Vente,125000,,,LE VLG,B119,54620,54067,Beuveille,54,,,54067000AB0335,,,,,,,,,,,,,0,,,,,S,sols,,,117,5.691577,49.43333
2020-762659,2020-10-08,000001,Vente,125000,,,LE VLG,B119,54620,54067,Beuveille,54,,,54067000AB0338,,,,,,,,,,,,,0,,,,,S,sols,,,8,5.691551,49.433248
2020-762937,2020-11-10,000001,Vente,68985,,,LA GOULETTE,B063,54620,54067,Beuveille,54,,,540670000Y0396,,,,,,,,,,,,,0,,,,,P,prés,,,657,5.693304,49.434221
2020-763288,2020-12-04,000001,Vente,117000,2,B,RUE EMILE ZOLA,0130,54620,54067,Beuveille,54,,,54067000AB0746,,,,,,,,,,,,,0,1,Maison,80,1,S,sols,,,50,5.691663,49.43298
