id_mutation,date_mutation,numero_disposition,nature_mutation,valeur_fonciere,adresse_numero,adresse_suffixe,adresse_nom_voie,adresse_code_voie,code_postal,code_commune,nom_commune,code_departement,ancien_code_commune,ancien_nom_commune,id_parcelle,ancien_id_parcelle,numero_volume,lot1_numero,lot1_surface_carrez,lot2_numero,lot2_surface_carrez,lot3_numero,lot3_surface_carrez,lot4_numero,lot4_surface_carrez,lot5_numero,lot5_surface_carrez,nombre_lots,code_type_local,type_local,surface_reelle_bati,nombre_pieces_principales,code_nature_culture,nature_culture,code_nature_culture_speciale,nature_culture_speciale,surface_terrain,longitude,latitude
2020-764067,2020-04-01,000001,Vente,84000,1,B,CRIVILLER,B021,54120,54365,Merviller,54,,,543650000E0253,,,,,,,,,,,,,0,1,Maison,95,4,S,sols,,,858,6.752662,48.464532
2020-764294,2020-06-08,000001,Vente,2000,,,DEVANT MARMANWOIVRE,B028,54120,54365,Merviller,54,,,543650000A0019,,,,,,,,,,,,,0,,,,,T,terres,,,1780,6.784638,48.493933
2020-764294,2020-06-08,000001,Vente,2000,,,DEVANT MARMANWOIVRE,B028,54120,54365,Merviller,54,,,543650000A0020,,,,,,,,,,,,,0,,,,,T,terres,,,890,6.784418,48.493986
2020-764294,2020-06-08,000001,Vente,2000,,,DEVANT MARMANWOIVRE,B028,54120,54365,Merviller,54,,,543650000A0024,,,,,,,,,,,,,0,,,,,T,terres,,,1540,6.784026,48.493576
2020-764294,2020-06-08,000001,Vente,2000,,,DEVANT MARMANWOIVRE,B028,54120,54365,Merviller,54,,,543650000A0065,,,,,,,,,,,,,0,,,,,T,terres,,,1750,6.786544,48.493173
2020-764336,2020-06-23,000001,Vente,12500,,,LA GODINE,B036,54120,54365,Merviller,54,,,543650000E0017,,,,,,,,,,,,,0,,,,,P,prés,,,15720,6.743441,48.471721
2020-764336,2020-06-23,000001,Vente,12500,,,LA GODINE,B036,54120,54365,Merviller,54,,,543650000E0022,,,,,,,,,,,,,0,,,,,P,prés,,,3065,6.74498,48.470497
2020-764363,2020-06-25,000001,Vente,99900,,,AUX CARRIERES,B009,54120,54365,Merviller,54,,,543650000B0018,,,,,,,,,,,,,0,,,,,J,jardins,,,145,6.795503,48.484094
2020-764363,2020-06-25,000001,Vente,99900,20,,AUX CARRIERES,B009,54120,54365,Merviller,54,,,543650000B0042,,,,,,,,,,,,,0,1,Maison,112,4,S,sols,,,817,6.795433,48.483869
2020-764363,2020-06-25,000001,Vente,99900,,,AUX CARRIERES,B009,54120,54365,Merviller,54,,,543650000B0043,,,,,,,,,,,,,0,,,,,VE,vergers,,,780,6.79532,48.483675
2020-764363,2020-06-25,000001,Vente,99900,,,AUX CARRIERES,B009,54120,54365,Merviller,54,,,543650000B0550,,,,,,,,,,,,,0,,,,,J,jardins,,,478,6.795146,48.483845
2020-764410,2020-06-30,000001,Vente,177400,,,LE VILLAGE,B070,54120,54365,Merviller,54,,,543650000G0087,,,,,,,,,,,,,0,,,,,VE,vergers,,,560,6.775971,48.480544
2020-764410,2020-06-30,000001,Vente,177400,,,LE VILLAGE,B070,54120,54365,Merviller,54,,,543650000G0088,,,,,,,,,,,,,0,,,,,P,prés,,,790,6.775858,48.480427
2020-764410,2020-06-30,000001,Vente,177400,,,LE VILLAGE,B070,54120,54365,Merviller,54,,,543650000G0089,,,,,,,,,,,,,0,,,,,S,sols,,,745,6.775442,48.480609
2020-764410,2020-06-30,000001,Vente,177400,18,,RUE DE MONTIGNY,0080,54120,54365,Merviller,54,,,543650000G0090,,,,,,,,,,,,,0,1,Maison,181,4,S,sols,,,415,6.775262,48.480649
2020-764490,2020-07-28,000001,Vente,361000,,,LA GODINE,B036,54120,54365,Merviller,54,,,543650000E0051,,,,,,,,,,,,,0,,,,,VE,vergers,,,644,6.753455,48.467902
2020-764490,2020-07-28,000001,Vente,361000,,,LA GODINE,B036,54120,54365,Merviller,54,,,543650000E0052,,,,,,,,,,,,,0,,,,,VE,vergers,,,450,6.753463,48.468054
2020-764490,2020-07-28,000001,Vente,361000,,,LA GODINE,B036,54120,54365,Merviller,54,,,543650000E0053,,,,,,,,,,,,,0,,,,,VE,vergers,,,520,6.753483,48.468119
2020-764490,2020-07-28,000001,Vente,361000,,,LA GODINE,B036,54120,54365,Merviller,54,,,543650000E0054,,,,,,,,,,,,,0,,,,,P,prés,,,1050,6.753509,48.468196
2020-764490,2020-07-28,000001,Vente,361000,,,LA GODINE,B036,54120,54365,Merviller,54,,,543650000E0508,,,,,,,,,,,,,0,,,,,P,prés,,,10259,6.751383,48.46806
2020-764490,2020-07-28,000001,Vente,361000,,,LA GODINE,B036,54120,54365,Merviller,54,,,543650000E0511,,,,,,,,,,,,,0,,,,,P,prés,,,7280,6.752321,48.468238
2020-764490,2020-07-28,000001,Vente,361000,,,LA GODINE,B036,54120,54365,Merviller,54,,,543650000E0512,,,,,,,,,,,,,0,,,,,P,prés,,,2330,6.753047,48.468211
2020-764490,2020-07-28,000001,Vente,361000,,,LA GODINE,B036,54120,54365,Merviller,54,,,543650000E0515,,,,,,,,,,,,,0,,,,,J,jardins,,,6686,6.75379,48.468599
2020-764490,2020-07-28,000001,Vente,361000,35,,CRIVILLER,B021,54120,54365,Merviller,54,,,543650000E0667,,,,,,,,,,,,,0,1,Maison,420,10,S,sols,,,753,6.75422,48.468297
2020-764490,2020-07-28,000001,Vente,361000,,,LA GODINE,B036,54120,54365,Merviller,54,,,543650000E0670,,,,,,,,,,,,,0,,,,,P,prés,,,2038,6.753764,48.468288
2020-765126,2020-10-30,000001,Vente,145000,,,LE VILLAGE,B070,54120,54365,Merviller,54,,,543650000G0389,,,,,,,,,,,,,0,,,,,S,sols,,,363,6.778645,48.48042
2020-765126,2020-10-30,000001,Vente,145000,9,A,RUE DE GRAMMONT,0040,54120,54365,Merviller,54,,,543650000G0393,,,,,,,,,,,,,0,1,Maison,52,2,S,sols,,,342,6.778773,48.480468
2020-765302,2020-10-29,000001,Vente,1600,,,BELLEMANDES,B005,54120,54365,Merviller,54,,,543650000D0199,,,,,,,,,,,,,0,,,,,T,terres,,,2205,6.773117,48.470573
2020-765302,2020-10-29,000001,Vente,1600,,,A LA FOSSE,B034,54120,54365,Merviller,54,,,543650000E0341,,,,,,,,,,,,,0,,,,,T,terres,,,1260,6.76914,48.478782
