id_mutation,date_mutation,numero_disposition,nature_mutation,valeur_fonciere,adresse_numero,adresse_suffixe,adresse_nom_voie,adresse_code_voie,code_postal,code_commune,nom_commune,code_departement,ancien_code_commune,ancien_nom_commune,id_parcelle,ancien_id_parcelle,numero_volume,lot1_numero,lot1_surface_carrez,lot2_numero,lot2_surface_carrez,lot3_numero,lot3_surface_carrez,lot4_numero,lot4_surface_carrez,lot5_numero,lot5_surface_carrez,nombre_lots,code_type_local,type_local,surface_reelle_bati,nombre_pieces_principales,code_nature_culture,nature_culture,code_nature_culture_speciale,nature_culture_speciale,surface_terrain,longitude,latitude
2020-765780,2020-03-13,000001,Vente,4000,,,LA QUARELLE,B062,54113,54392,Moutrot,54,,,54392000ZB0132,,,,,,,,,,,,,0,,,,,P,prés,,,370,5.897272,48.603008
2020-765948,2020-05-27,000001,Vente terrain à bâtir,48060,85,,RUE DES GRANDS JARDINS,0009,54113,54392,Moutrot,54,,,54392000AA0237,,,,,,,,,,,,,0,,,,,AB,terrains a bâtir,,,67,5.890746,48.602817
2020-765948,2020-05-27,000001,Vente terrain à bâtir,48060,,,GRANDE RUE AU MIDI,B027,54113,54392,Moutrot,54,,,54392000AA0241,,,,,,,,,,,,,0,,,,,AB,terrains a bâtir,,,467,5.890934,48.602791
2020-766178,2020-07-28,000001,Vente,170000,65,,IMP DE LA PELLETIERE,0043,54113,54392,Moutrot,54,,,54392000AA0206,,,,,,,,,,,,,0,1,Maison,105,3,S,sols,,,380,5.898499,48.600617
2020-766595,2020-10-20,000001,Vente,134500,206,,FERME DE LA CHATELAINE,B081,54113,54392,Moutrot,54,,,54392000ZA0136,,,,,,,,,,,,,0,1,Maison,130,7,S,sols,,,1089,5.889968,48.605016
2020-766595,2020-10-20,000001,Vente,134500,206,,FERME DE LA CHATELAINE,B081,54113,54392,Moutrot,54,,,54392000ZA0136,,,,,,,,,,,,,0,1,Maison,130,7,VE,vergers,,,833,5.889968,48.605016
2020-766663,2020-10-26,000001,Vente,3180.2,,,PRES NICOLAS,B061,54113,54392,Moutrot,54,,,543920000C0123,,,,,,,,,,,,,0,,,,,BT,taillis simples,,,943,5.908034,48.595607
2020-766663,2020-10-26,000001,Vente,3180.2,,,PRES NICOLAS,B061,54113,54392,Moutrot,54,,,543920000C0125,,,,,,,,,,,,,0,,,,,BT,taillis simples,,,1016,5.908067,48.595397
2020-766663,2020-10-26,000001,Vente,3180.2,,,BARANCOTE,B001,54113,54392,Moutrot,54,,,543920000C0160,,,,,,,,,,,,,0,,,,,BR,futaies résineuses,,,798,5.909152,48.598445
2020-766663,2020-10-26,000001,Vente,3180.2,,,SUR LES MOULINS,B043,54113,54392,Moutrot,54,,,543920000C0297,,,,,,,,,,,,,0,,,,,BR,futaies résineuses,,,855,5.90369,48.59451
2020-766663,2020-10-26,000001,Vente,3180.2,,,SUR LES MOULINS,B043,54113,54392,Moutrot,54,,,543920000C0312,,,,,,,,,,,,,0,,,,,BT,taillis simples,,,1307,5.903582,48.592896
2020-766663,2020-10-26,000001,Vente,3180.2,,,SUR LES MOULINS,B043,54113,54392,Moutrot,54,,,543920000C0318,,,,,,,,,,,,,0,,,,,BT,taillis simples,,,1476,5.902231,48.592085
2020-766663,2020-10-26,000001,Vente,3180.2,,,TERRE MONSIEUR,B069,54113,54392,Moutrot,54,,,54392000WB0025,,,,,,,,,,,,,0,,,,,T,terres,,,2160,5.88082,48.604077
2020-766663,2020-10-26,000001,Vente,3180.2,,,TERRE MONSIEUR,B069,54113,54392,Moutrot,54,,,54392000WB0028,,,,,,,,,,,,,0,,,,,T,terres,,,1880,5.881386,48.604096
2020-766663,2020-10-26,000001,Vente,3180.2,,,TERRE MONSIEUR,B069,54113,54392,Moutrot,54,,,54392000WB0028,,,,,,,,,,,,,0,,,,,T,terres,,,3770,5.881386,48.604096
2020-766663,2020-10-26,000001,Vente,3180.2,,,TERRE MONSIEUR,B069,54113,54392,Moutrot,54,,,54392000WB0031,,,,,,,,,,,,,0,,,,,T,terres,,,370,5.880759,48.603636
2020-766899,2020-12-17,000001,Vente,122000,80,,RUE DU CUGNOT,0008,54113,54392,Moutrot,54,,,54392000AA0062,,,,,,,,,,,,,0,1,Maison,80,4,S,sols,,,96,5.895077,48.602052
2020-766899,2020-12-17,000001,Vente,122000,72,,RUE DU CUGNOT,0008,54113,54392,Moutrot,54,,,54392000AA0223,,,,,,,,,,,,,0,,,,,S,sols,,,41,5.894949,48.602089
