id_mutation,date_mutation,numero_disposition,nature_mutation,valeur_fonciere,adresse_numero,adresse_suffixe,adresse_nom_voie,adresse_code_voie,code_postal,code_commune,nom_commune,code_departement,ancien_code_commune,ancien_nom_commune,id_parcelle,ancien_id_parcelle,numero_volume,lot1_numero,lot1_surface_carrez,lot2_numero,lot2_surface_carrez,lot3_numero,lot3_surface_carrez,lot4_numero,lot4_surface_carrez,lot5_numero,lot5_surface_carrez,nombre_lots,code_type_local,type_local,surface_reelle_bati,nombre_pieces_principales,code_nature_culture,nature_culture,code_nature_culture_speciale,nature_culture_speciale,surface_terrain,longitude,latitude
2020-751913,2020-01-31,000001,Vente,7520,,,POIREMONT,B032,54330,54407,Ognéville,54,,,54407000ZA0078,,,,,,,,,,,,,0,,,,,P,prés,,,3625,6.063385,48.47943
2020-751913,2020-01-31,000001,Vente,7520,,,POIREMONT,B032,54330,54407,Ognéville,54,,,54407000ZA0078,,,,,,,,,,,,,0,,,,,P,prés,,,3625,6.063385,48.47943
2020-751913,2020-01-31,000001,Vente,7520,,,SOUS LE FEVRIL,B044,54330,54407,Ognéville,54,,,54407000ZA0101,,,,,,,,,,,,,0,,,,,P,prés,,,11543,6.06547,48.476701
2020-757354,2020-09-28,000001,Vente,135000,,,LE VILLAGE,B050,54330,54407,Ognéville,54,,,544070000D0007,,,,,,,,,,,,,0,,,,,J,jardins,,,855,6.064143,48.475037
2020-757354,2020-09-28,000001,Vente,135000,,,LE VILLAGE,B050,54330,54407,Ognéville,54,,,544070000D0007,,,,,,,,,,,,,0,,,,,S,sols,,,80,6.064143,48.475037
2020-757354,2020-09-28,000001,Vente,135000,34,,RUE DU MARECHAL LYAUTEY,0065,54330,54407,Ognéville,54,,,544070000D0008,,,,,,,,,,,,,0,1,Maison,108,5,S,sols,,,366,6.064248,48.474837
2020-758158,2020-10-28,000001,Vente,123400,6,,RUE DES ROSES,0085,54330,54407,Ognéville,54,,,544070000D0101,,,,,,,,,,,,,0,1,Maison,157,6,S,sols,,,375,6.065676,48.473837
2020-758158,2020-10-28,000001,Vente,123400,,,LE VILLAGE,B050,54330,54407,Ognéville,54,,,544070000D0198,,,,,,,,,,,,,0,,,,,J,jardins,,,206,6.065623,48.473693
2020-758158,2020-10-28,000001,Vente,123400,,,LE VILLAGE,B050,54330,54407,Ognéville,54,,,544070000D0227,,,,,,,,,,,,,0,,,,,J,jardins,,,48,6.06575,48.473734
