id_mutation,date_mutation,numero_disposition,nature_mutation,valeur_fonciere,adresse_numero,adresse_suffixe,adresse_nom_voie,adresse_code_voie,code_postal,code_commune,nom_commune,code_departement,ancien_code_commune,ancien_nom_commune,id_parcelle,ancien_id_parcelle,numero_volume,lot1_numero,lot1_surface_carrez,lot2_numero,lot2_surface_carrez,lot3_numero,lot3_surface_carrez,lot4_numero,lot4_surface_carrez,lot5_numero,lot5_surface_carrez,nombre_lots,code_type_local,type_local,surface_reelle_bati,nombre_pieces_principales,code_nature_culture,nature_culture,code_nature_culture_speciale,nature_culture_speciale,surface_terrain,longitude,latitude
2020-763784,2020-01-17,000001,Vente,38000,9001,,SOUS LA BEAUMONT,B031,54300,54449,Rehainviller,54,,,54449000ZB0026,,,,,,,,,,,,,0,4,Local industriel. commercial ou assimilé,478,0,S,sols,,,1700,6.474875,48.572758
2020-763784,2020-01-17,000001,Vente,38000,9001,,SOUS LA BEAUMONT,B031,54300,54449,Rehainviller,54,,,54449000ZB0026,,,,,,,,,,,,,0,1,Maison,75,4,S,sols,,,1700,6.474875,48.572758
2020-763784,2020-01-17,000001,Vente,38000,,,SOUS LA BEAUMONT,B031,54300,54449,Rehainviller,54,,,54449000ZB0028,,,,,,,,,,,,,0,,,,,S,sols,,,347,6.474679,48.572778
2020-763784,2020-01-17,000001,Vente,38000,,,SOUS LA BEAUMONT,B031,54300,54449,Rehainviller,54,,,54449000ZB0035,,,,,,,,,,,,,0,,,,,P,prés,,,751,6.474751,48.572478
2020-763795,2020-02-10,000001,Vente,218300,,,SAINT GEORGES PRE,B030,54300,54449,Rehainviller,54,,,54449000ZA0455,,,,,,,,,,,,,0,,,,,J,jardins,,,542,6.475981,48.564864
2020-763795,2020-02-10,000001,Vente,218300,27,,RUE DES PLATANES,0140,54300,54449,Rehainviller,54,,,54449000ZA0456,,,,,,,,,,,,,0,1,Maison,108,4,S,sols,,,483,6.475765,48.564757
2020-763930,2020-02-17,000001,Vente,241200,17,,RUE DES CHAUMES,0028,54300,54449,Rehainviller,54,,,54449000ZA0430,,,,,,,,,,,,,0,1,Maison,104,4,S,sols,,,651,6.471517,48.560301
2020-763963,2020-03-13,000001,Vente,127000,,,MORTES DU HAND,B025,54300,54449,Rehainviller,54,,,54449000ZA0286,,,,,,,,,,,,,0,,,,,S,sols,,,5,6.471523,48.559859
2020-763963,2020-03-13,000001,Vente,127000,7,,FONTENY,B017,54300,54449,Rehainviller,54,,,54449000ZA0288,,,,,,,,,,,,,0,1,Maison,76,5,S,sols,,,498,6.47135,48.559918
2020-763963,2020-03-13,000001,Vente,127000,,,MORTES DU HAND,B025,54300,54449,Rehainviller,54,,,54449000ZA0291,,,,,,,,,,,,,0,,,,,S,sols,,,16,6.471496,48.5599
2020-763981,2020-02-29,000001,Vente,180000,3,,RUE DES PLATANES,0140,54300,54449,Rehainviller,54,,,54449000ZA0442,,,,,,,,,,,,,0,1,Maison,102,5,S,sols,,,695,6.473529,48.563689
2020-764132,2020-05-18,000001,Vente,276200,12,,RUE BARBELIN,0076,54300,54449,Rehainviller,54,,,54449000ZA0619,,,,,,,,,,,,,0,1,Maison,130,4,S,sols,,,501,6.472883,48.562322
2020-764205,2020-05-19,000001,Vente,233000,,,SUR BARBELIN,B002,54300,54449,Rehainviller,54,,,54449000ZA0611,,,,,,,,,,,,,0,,,,,S,sols,,,89,6.47325,48.562307
2020-764205,2020-05-19,000001,Vente,233000,9,,RUE BARBELIN,0076,54300,54449,Rehainviller,54,,,54449000ZA0623,,,,,,,,,,,,,0,1,Maison,110,4,S,sols,,,412,6.473104,48.562236
2020-764250,2020-05-15,000001,Vente,70000,4,,RUE DU LT YVES DE RAVINEL,0100,54300,54449,Rehainviller,54,,,54449000ZA0562,,,,,,,,,,,,,0,1,Maison,107,5,S,sols,,,413,6.470358,48.562426
2020-764250,2020-05-15,000001,Vente,70000,,,LE VILLAGE,B037,54300,54449,Rehainviller,54,,,54449000ZA0563,,,,,,,,,,,,,0,,,,,J,jardins,,,386,6.470634,48.562206
2020-764250,2020-05-15,000001,Vente,70000,,,LE VILLAGE,B037,54300,54449,Rehainviller,54,,,54449000ZA0564,,,,,,,,,,,,,0,,,,,VE,vergers,,,427,6.471093,48.561879
2020-764464,2020-07-23,000001,Vente,150000,23,,RUE DU LT YVES DE RAVINEL,0100,54300,54449,Rehainviller,54,,,544490000D0110,,,,,,,,,,,,,0,1,Maison,158,5,S,sols,,,423,6.468753,48.561515
2020-764538,2020-08-10,000001,Vente,186750,13,,RUE BARBELIN,0076,54300,54449,Rehainviller,54,,,54449000ZA0602,,,,,,,,,,,,,0,1,Maison,92,5,S,sols,,,342,6.473553,48.562163
2020-764538,2020-08-10,000001,Vente,186750,,,SUR BARBELIN,B002,54300,54449,Rehainviller,54,,,54449000ZA0624,,,,,,,,,,,,,0,,,,,S,sols,,,4,6.473413,48.562166
2020-764836,2020-09-28,000001,Vente,183233,57,,RUE DES PLATANES,0140,54300,54449,Rehainviller,54,,,54449000ZA0484,,,,,,,,,,,,,0,1,Maison,92,4,S,sols,,,500,6.47261,48.564343
2020-764836,2020-09-28,000001,Vente,183233,57,,RUE DES PLATANES,0140,54300,54449,Rehainviller,54,,,54449000ZA0484,,,,,,,,,,,,,0,1,Maison,92,4,P,prés,,,246,6.47261,48.564343
2020-764919,2020-10-08,000001,Vente,252100,5,,RUE BARBELIN,0076,54300,54449,Rehainviller,54,,,54449000ZA0609,,,,,,,,,,,,,0,1,Maison,124,6,S,sols,,,484,6.47356,48.562482
2020-765019,2020-10-21,000001,Vente,226100,5,,RUE DES CHAUMES,0028,54300,54449,Rehainviller,54,,,54449000ZA0437,,,,,,,,,,,,,0,1,Maison,111,4,S,sols,,,593,6.470278,48.559593
2020-765021,2020-10-29,000001,Vente,216000,,,SUR BARBELIN,B002,54300,54449,Rehainviller,54,,,54449000ZA0333,,,,,,,,,,,,,0,,,,,S,sols,,,181,6.473004,48.561025
2020-765021,2020-10-29,000001,Vente,216000,16,,CHE DU FONTENY,0046,54300,54449,Rehainviller,54,,,54449000ZA0341,,,,,,,,,,,,,0,1,Maison,147,4,S,sols,,,384,6.472886,48.560968
2020-765090,2020-11-03,000001,Vente,275000,,,LE VILLAGE,B037,54300,54449,Rehainviller,54,,,544490000D0316,,,,,,,,,,,,,0,,,,,AB,terrains a bâtir,,,795,6.4661,48.560221
2020-765090,2020-11-03,000001,Vente,275000,9,B,RUE GAMBETTA,0060,54300,54449,Rehainviller,54,,,544490000D0319,,,,,,,,,,,,,0,4,Local industriel. commercial ou assimilé,66,0,S,sols,,,500,6.466031,48.560354
2020-765090,2020-11-03,000001,Vente,275000,9,B,RUE GAMBETTA,0060,54300,54449,Rehainviller,54,,,544490000D0319,,,,,,,,,,,,,0,1,Maison,103,3,J,jardins,,,641,6.466031,48.560354
2020-765090,2020-11-03,000001,Vente,275000,9,B,RUE GAMBETTA,0060,54300,54449,Rehainviller,54,,,544490000D0319,,,,,,,,,,,,,0,4,Local industriel. commercial ou assimilé,66,0,J,jardins,,,641,6.466031,48.560354
2020-765090,2020-11-03,000001,Vente,275000,9,B,RUE GAMBETTA,0060,54300,54449,Rehainviller,54,,,544490000D0319,,,,,,,,,,,,,0,1,Maison,103,3,S,sols,,,500,6.466031,48.560354
2020-765139,2020-11-20,000001,Vente,125000,13,,RUE CARNOT,0025,54300,54449,Rehainviller,54,,,544490000D0093,,,,,,,,,,,,,0,1,Maison,96,3,S,sols,,,276,6.468983,48.562367
2020-765343,2020-12-28,000001,Vente,258000,9,,RUE DES PLATANES,0140,54300,54449,Rehainviller,54,,,54449000ZA0445,,,,,,,,,,,,,0,1,Maison,140,5,S,sols,,,699,6.474263,48.56395
2020-765376,2020-12-11,000001,Vente,53250,6,,RUE D ADOMENIL,0010,54300,54449,Rehainviller,54,,,544490000D0013,,,,,,,,,,,,,0,1,Maison,62,2,S,sols,,,261,6.465547,48.562582
2020-765376,2020-12-11,000001,Vente,53250,,,LE VILLAGE,B037,54300,54449,Rehainviller,54,,,544490000D0311,,,,,,,,,,,,,0,,,,,S,sols,,,19,6.465538,48.562508
2020-765414,2020-12-15,000001,Vente,248900,7,,RUE DES PLATANES,0140,54300,54449,Rehainviller,54,,,54449000ZA0444,,,,,,,,,,,,,0,1,Maison,108,4,S,sols,,,699,6.474021,48.563879
2020-765420,2020-12-28,000001,Vente,203500,59,,RUE DES PLATANES,0140,54300,54449,Rehainviller,54,,,54449000ZA0483,,,,,,,,,,,,,0,1,Maison,100,4,P,prés,,,179,6.472465,48.564169
2020-765420,2020-12-28,000001,Vente,203500,59,,RUE DES PLATANES,0140,54300,54449,Rehainviller,54,,,54449000ZA0483,,,,,,,,,,,,,0,1,Maison,100,4,S,sols,,,500,6.472465,48.564169
