id_mutation,date_mutation,numero_disposition,nature_mutation,valeur_fonciere,adresse_numero,adresse_suffixe,adresse_nom_voie,adresse_code_voie,code_postal,code_commune,nom_commune,code_departement,ancien_code_commune,ancien_nom_commune,id_parcelle,ancien_id_parcelle,numero_volume,lot1_numero,lot1_surface_carrez,lot2_numero,lot2_surface_carrez,lot3_numero,lot3_surface_carrez,lot4_numero,lot4_surface_carrez,lot5_numero,lot5_surface_carrez,nombre_lots,code_type_local,type_local,surface_reelle_bati,nombre_pieces_principales,code_nature_culture,nature_culture,code_nature_culture_speciale,nature_culture_speciale,surface_terrain,longitude,latitude
2020-767522,2020-05-14,000001,Vente,45000,,,LE VILLAGE NORD,B153,55230,55013,Arrancy-sur-Crusne,55,,,55013000AA0189,,,,,,,,,,,,,0,,,,,VE,vergers,,,1215,5.656374,49.414377
2020-767636,2020-06-02,000001,Vente,132000,9,,RUE VERMONT,0093,55230,55013,Arrancy-sur-Crusne,55,,,55013000AA0048,,,,,,,,,,,,,0,1,Maison,130,4,S,sols,,,247,5.658161,49.414295
2020-767734,2020-06-23,000001,Vente,130000,3,,RUE DES EURANTES,0050,55230,55013,Arrancy-sur-Crusne,55,,,55013000AB0116,,,,,,,,,,,,,0,1,Maison,92,3,S,sols,,,341,5.65864,49.411686
2020-767821,2020-07-10,000001,Vente,15000,,,HAMEAU DE LOPIGNEUX,B078,55230,55013,Arrancy-sur-Crusne,55,,,550130000A0910,,,,,,,,,,,,,0,,,,,S,sols,,,44,5.642971,49.428302
2020-767821,2020-07-10,000001,Vente,15000,,,HAMEAU DE LOPIGNEUX,B078,55230,55013,Arrancy-sur-Crusne,55,,,550130000A0925,,,,,,,,,,,,,0,,,,,S,sols,,,512,5.643126,49.428315
2020-768012,2020-08-05,000001,Vente,26250,,,SUR BEZEPRE,B016,55230,55013,Arrancy-sur-Crusne,55,,,55013000YM0005,,,,,,,,,,,,,0,,,,,T,terres,,,6090,5.683939,49.40418
2020-768012,2020-08-05,000001,Vente,26250,,,SUR BEZEPRE,B016,55230,55013,Arrancy-sur-Crusne,55,,,55013000YM0005,,,,,,,,,,,,,0,,,,,L,landes,FRICH,Friche,10294,5.683939,49.40418
2020-768012,2020-08-05,000001,Vente,26250,,,SUR BEZEPRE,B016,55230,55013,Arrancy-sur-Crusne,55,,,55013000YM0006,,,,,,,,,,,,,0,,,,,T,terres,,,36305,5.683886,49.403408
2020-768012,2020-08-05,000001,Vente,26250,,,SUR BEZEPRE,B016,55230,55013,Arrancy-sur-Crusne,55,,,55013000YM0006,,,,,,,,,,,,,0,,,,,L,landes,FRICH,Friche,13925,5.683886,49.403408
2020-768012,2020-08-05,000001,Vente,26250,,,SUR BEZEPRE,B016,55230,55013,Arrancy-sur-Crusne,55,,,55013000YM0006,,,,,,,,,,,,,0,,,,,T,terres,,,3175,5.683886,49.403408
2020-768012,2020-08-05,000001,Vente,26250,,,SUR BEZEPRE,B016,55230,55013,Arrancy-sur-Crusne,55,,,55013000YM0006,,,,,,,,,,,,,0,,,,,T,terres,,,17770,5.683886,49.403408
2020-768209,2020-09-23,000001,Vente,135000,2,,RUE DU RAMENIL,0085,55230,55013,Arrancy-sur-Crusne,55,,,55013000AA0060,,,,,,,,,,,,,0,1,Maison,120,5,S,sols,,,458,5.658873,49.414679
2020-768291,2020-10-14,000001,Vente,800,,,DEVANT LE HAUT DE METZ,B054,55230,55013,Arrancy-sur-Crusne,55,,,55013000ZW0017,,,,,,,,,,,,,0,,,,,T,terres,,,1000,5.667888,49.413096
2020-770119,2020-12-11,000001,Vente,45000,,,BAS DE LA FONTAINE AU VIN,B011,55230,55013,Arrancy-sur-Crusne,55,,,55013000YM0021,,,,,,,,,,,,,0,,,,,T,terres,,,25175,5.676064,49.397038
2020-770119,2020-12-11,000001,Vente,45000,,,BAS DE LA FONTAINE AU VIN,B011,55230,55013,Arrancy-sur-Crusne,55,,,55013000YM0021,,,,,,,,,,,,,0,,,,,T,terres,,,7036,5.676064,49.397038
2020-770119,2020-12-11,000001,Vente,45000,,,BAS DE LA FONTAINE AU VIN,B011,55230,55013,Arrancy-sur-Crusne,55,,,55013000YM0021,,,,,,,,,,,,,0,,,,,T,terres,,,60925,5.676064,49.397038
2020-770217,2020-12-23,000001,Vente,230000,16,,RUE DES EURANTES,0050,55230,55013,Arrancy-sur-Crusne,55,,,55013000AB0177,,,,,,,,,,,,,0,1,Maison,202,4,S,sols,,,481,5.660496,49.411435
2020-770363,2020-12-17,000001,Vente,21000,,,CHEMIN DES VACHES,B031,55230,55013,Arrancy-sur-Crusne,55,,,55013000ZR0025,,,,,,,,,,,,,0,,,,,T,terres,,,28285,5.641092,49.413358
2020-770363,2020-12-17,000001,Vente,21000,,,CHEMIN DES VACHES,B031,55230,55013,Arrancy-sur-Crusne,55,,,55013000ZR0025,,,,,,,,,,,,,0,,,,,T,terres,,,18761,5.641092,49.413358
2020-770363,2020-12-17,000001,Vente,21000,,,CHEMIN DES VACHES,B031,55230,55013,Arrancy-sur-Crusne,55,,,55013000ZR0026,,,,,,,,,,,,,0,,,,,T,terres,,,737,5.640389,49.413877
2020-770363,2020-12-17,000001,Vente,21000,,,CHEMIN DES VACHES,B031,55230,55013,Arrancy-sur-Crusne,55,,,55013000ZR0026,,,,,,,,,,,,,0,,,,,T,terres,,,736,5.640389,49.413877
