id_mutation,date_mutation,numero_disposition,nature_mutation,valeur_fonciere,adresse_numero,adresse_suffixe,adresse_nom_voie,adresse_code_voie,code_postal,code_commune,nom_commune,code_departement,ancien_code_commune,ancien_nom_commune,id_parcelle,ancien_id_parcelle,numero_volume,lot1_numero,lot1_surface_carrez,lot2_numero,lot2_surface_carrez,lot3_numero,lot3_surface_carrez,lot4_numero,lot4_surface_carrez,lot5_numero,lot5_surface_carrez,nombre_lots,code_type_local,type_local,surface_reelle_bati,nombre_pieces_principales,code_nature_culture,nature_culture,code_nature_culture_speciale,nature_culture_speciale,surface_terrain,longitude,latitude
2020-767085,2020-01-24,000001,Vente,52900,1,,RTE DE BREHEVILLE,0015,55150,55071,Brandeville,55,,,550710000B1080,,,,,,,,,,,,,0,1,Maison,77,4,S,sols,,,195,5.305027,49.39462
2020-767085,2020-01-24,000001,Vente,52900,,,VOIE DE DUN,B090,55150,55071,Brandeville,55,,,55071000ZB0004,,,,,,,,,,,,,0,,,,,L,landes,FRICH,Friche,10380,5.299509,49.394107
2020-767393,2020-03-10,000001,Vente,72666,,,LA CITADELLE,B013,55150,55071,Brandeville,55,,,550710000C0118,,,,,,,,,,,,,0,,,,,B,bois,,,115,5.29883,49.390613
2020-767393,2020-03-10,000001,Vente,72666,,,LA CITADELLE,B013,55150,55071,Brandeville,55,,,550710000C0118,,,,,,,,,,,,,0,,,,,BT,taillis simples,,,5675,5.29883,49.390613
2020-767393,2020-03-10,000001,Vente,72666,,,LA VAUX JOBY,B088,55150,55071,Brandeville,55,,,550710000C0438,,,,,,,,,,,,,0,,,,,BT,taillis simples,,,2058,5.280642,49.379817
2020-767393,2020-03-10,000001,Vente,72666,,,LA VAUX JOBY,B088,55150,55071,Brandeville,55,,,550710000C0438,,,,,,,,,,,,,0,,,,,B,bois,,,42,5.280642,49.379817
2020-767393,2020-03-10,000001,Vente,72666,,,FONTAINE L ANE,B033,55150,55071,Brandeville,55,,,550710000C0595,,,,,,,,,,,,,0,,,,,BT,taillis simples,,,339,5.298348,49.382226
2020-767393,2020-03-10,000001,Vente,72666,,,FONTAINE L ANE,B033,55150,55071,Brandeville,55,,,550710000C0595,,,,,,,,,,,,,0,,,,,B,bois,,,6,5.298348,49.382226
2020-767393,2020-03-10,000001,Vente,72666,,,FONTAINE L ANE,B033,55150,55071,Brandeville,55,,,550710000C0608,,,,,,,,,,,,,0,,,,,BT,taillis simples,,,971,5.297361,49.384255
2020-767393,2020-03-10,000001,Vente,72666,,,FONTAINE L ANE,B033,55150,55071,Brandeville,55,,,550710000C0608,,,,,,,,,,,,,0,,,,,B,bois,,,19,5.297361,49.384255
2020-767393,2020-03-10,000001,Vente,72666,,,FONTAINE L ANE,B033,55150,55071,Brandeville,55,,,550710000C0617,,,,,,,,,,,,,0,,,,,BT,taillis simples,,,2208,5.296075,49.385213
2020-767393,2020-03-10,000001,Vente,72666,,,FONTAINE L ANE,B033,55150,55071,Brandeville,55,,,550710000C0617,,,,,,,,,,,,,0,,,,,B,bois,,,45,5.296075,49.385213
2020-767393,2020-03-10,000001,Vente,72666,,,FONTAINE L ANE,B033,55150,55071,Brandeville,55,,,550710000C0723,,,,,,,,,,,,,0,,,,,B,bois,,,7,5.299047,49.383291
2020-767393,2020-03-10,000001,Vente,72666,,,FONTAINE L ANE,B033,55150,55071,Brandeville,55,,,550710000C0723,,,,,,,,,,,,,0,,,,,BT,taillis simples,,,348,5.299047,49.383291
2020-767393,2020-03-10,000001,Vente,72666,,,LA CHEMINEE,B012,55150,55071,Brandeville,55,,,550710000C1120,,,,,,,,,,,,,0,,,,,B,bois,,,194,5.310406,49.379059
2020-767393,2020-03-10,000001,Vente,72666,,,LA CHEMINEE,B012,55150,55071,Brandeville,55,,,550710000C1120,,,,,,,,,,,,,0,,,,,BT,taillis simples,,,9546,5.310406,49.379059
2020-767393,2020-03-10,000001,Vente,72666,,,SARELEPUITS,B083,55150,55071,Brandeville,55,,,550710000C1390,,,,,,,,,,,,,0,,,,,BT,taillis simples,,,1167,5.286095,49.369351
2020-767393,2020-03-10,000001,Vente,72666,,,SARELEPUITS,B083,55150,55071,Brandeville,55,,,550710000C1390,,,,,,,,,,,,,0,,,,,B,bois,,,23,5.286095,49.369351
2020-767393,2020-03-10,000001,Vente,72666,,,SARELEPUITS,B083,55150,55071,Brandeville,55,,,550710000C1394,,,,,,,,,,,,,0,,,,,BT,taillis simples,,,1363,5.286579,49.369156
2020-767393,2020-03-10,000001,Vente,72666,,,SARELEPUITS,B083,55150,55071,Brandeville,55,,,550710000C1394,,,,,,,,,,,,,0,,,,,B,bois,,,27,5.286579,49.369156
2020-767393,2020-03-10,000001,Vente,72666,,,SARELEPUITS,B083,55150,55071,Brandeville,55,,,550710000C1397,,,,,,,,,,,,,0,,,,,B,bois,,,28,5.286859,49.370003
2020-767393,2020-03-10,000001,Vente,72666,,,SARELEPUITS,B083,55150,55071,Brandeville,55,,,550710000C1397,,,,,,,,,,,,,0,,,,,BT,taillis simples,,,1392,5.286859,49.370003
2020-767393,2020-03-10,000001,Vente,72666,,,SARELEPUITS,B083,55150,55071,Brandeville,55,,,550710000C1407,,,,,,,,,,,,,0,,,,,BT,taillis simples,,,2793,5.287295,49.371541
2020-767393,2020-03-10,000001,Vente,72666,,,SARELEPUITS,B083,55150,55071,Brandeville,55,,,550710000C1407,,,,,,,,,,,,,0,,,,,B,bois,,,57,5.287295,49.371541
2020-767393,2020-03-10,000001,Vente,72666,,,SARELEPUITS,B083,55150,55071,Brandeville,55,,,550710000C1408,,,,,,,,,,,,,0,,,,,B,bois,,,27,5.28634,49.371714
2020-767393,2020-03-10,000001,Vente,72666,,,SARELEPUITS,B083,55150,55071,Brandeville,55,,,550710000C1408,,,,,,,,,,,,,0,,,,,BT,taillis simples,,,1333,5.28634,49.371714
2020-767393,2020-03-10,000001,Vente,72666,,,SARELEPUITS,B083,55150,55071,Brandeville,55,,,550710000C1410,,,,,,,,,,,,,0,,,,,BT,taillis simples,,,2793,5.287392,49.371789
2020-767393,2020-03-10,000001,Vente,72666,,,SARELEPUITS,B083,55150,55071,Brandeville,55,,,550710000C1410,,,,,,,,,,,,,0,,,,,B,bois,,,57,5.287392,49.371789
2020-767393,2020-03-10,000001,Vente,72666,,,SARELEPUITS,B083,55150,55071,Brandeville,55,,,550710000C1412,,,,,,,,,,,,,0,,,,,B,bois,,,138,5.288199,49.371093
2020-767393,2020-03-10,000001,Vente,72666,,,SARELEPUITS,B083,55150,55071,Brandeville,55,,,550710000C1412,,,,,,,,,,,,,0,,,,,BT,taillis simples,,,6762,5.288199,49.371093
2020-767393,2020-03-10,000001,Vente,72666,,,SARELEPUITS,B083,55150,55071,Brandeville,55,,,550710000C1415,,,,,,,,,,,,,0,,,,,BT,taillis simples,,,1152,5.288853,49.372122
2020-767393,2020-03-10,000001,Vente,72666,,,SARELEPUITS,B083,55150,55071,Brandeville,55,,,550710000C1415,,,,,,,,,,,,,0,,,,,B,bois,,,23,5.288853,49.372122
2020-767393,2020-03-10,000001,Vente,72666,,,SARELEPUITS,B083,55150,55071,Brandeville,55,,,550710000C1422,,,,,,,,,,,,,0,,,,,BT,taillis simples,,,1551,5.288322,49.372697
2020-767393,2020-03-10,000001,Vente,72666,,,SARELEPUITS,B083,55150,55071,Brandeville,55,,,550710000C1422,,,,,,,,,,,,,0,,,,,B,bois,,,31,5.288322,49.372697
2020-767393,2020-03-10,000001,Vente,72666,,,SARELEPUITS,B083,55150,55071,Brandeville,55,,,550710000C1430,,,,,,,,,,,,,0,,,,,B,bois,,,17,5.291145,49.375923
2020-767393,2020-03-10,000001,Vente,72666,,,SARELEPUITS,B083,55150,55071,Brandeville,55,,,550710000C1430,,,,,,,,,,,,,0,,,,,BT,taillis simples,,,880,5.291145,49.375923
2020-767393,2020-03-10,000001,Vente,72666,,,SARELEPUITS,B083,55150,55071,Brandeville,55,,,550710000C1431,,,,,,,,,,,,,0,,,,,B,bois,,,12,5.291387,49.376202
2020-767393,2020-03-10,000001,Vente,72666,,,SARELEPUITS,B083,55150,55071,Brandeville,55,,,550710000C1431,,,,,,,,,,,,,0,,,,,BT,taillis simples,,,593,5.291387,49.376202
2020-767393,2020-03-10,000001,Vente,72666,,,SARELEPUITS,B083,55150,55071,Brandeville,55,,,550710000C1432,,,,,,,,,,,,,0,,,,,B,bois,,,5,5.291523,49.376376
2020-767393,2020-03-10,000001,Vente,72666,,,SARELEPUITS,B083,55150,55071,Brandeville,55,,,550710000C1432,,,,,,,,,,,,,0,,,,,BT,taillis simples,,,272,5.291523,49.376376
2020-767393,2020-03-10,000001,Vente,72666,,,SARELEPUITS,B083,55150,55071,Brandeville,55,,,550710000C1433,,,,,,,,,,,,,0,,,,,B,bois,,,97,5.292545,49.377367
2020-767393,2020-03-10,000001,Vente,72666,,,SARELEPUITS,B083,55150,55071,Brandeville,55,,,550710000C1433,,,,,,,,,,,,,0,,,,,BT,taillis simples,,,4794,5.292545,49.377367
2020-767393,2020-03-10,000001,Vente,72666,,,SARELEPUITS,B083,55150,55071,Brandeville,55,,,550710000C1466,,,,,,,,,,,,,0,,,,,B,bois,,,14,5.285055,49.370336
2020-767393,2020-03-10,000001,Vente,72666,,,SARELEPUITS,B083,55150,55071,Brandeville,55,,,550710000C1466,,,,,,,,,,,,,0,,,,,BT,taillis simples,,,696,5.285055,49.370336
2020-767393,2020-03-10,000001,Vente,72666,,,SARELEPUITS,B083,55150,55071,Brandeville,55,,,550710000C1484,,,,,,,,,,,,,0,,,,,B,bois,,,83,5.289762,49.369373
2020-767393,2020-03-10,000001,Vente,72666,,,SARELEPUITS,B083,55150,55071,Brandeville,55,,,550710000C1484,,,,,,,,,,,,,0,,,,,BT,taillis simples,,,4101,5.289762,49.369373
2020-767393,2020-03-10,000001,Vente,72666,,,DEVANT HATOIS,B028,55150,55071,Brandeville,55,,,55071000ZA0053,,,,,,,,,,,,,0,,,,,BT,taillis simples,,,2010,5.287918,49.379364
2020-767393,2020-03-10,000001,Vente,72666,,,AU DESSUS DU FOND JOMELET,B025,55150,55071,Brandeville,55,,,55071000ZI0223,,,,,,,,,,,,,0,,,,,BT,taillis simples,,,340,5.306231,49.377944
2020-767393,2020-03-10,000001,Vente,72666,,,AU DESSUS DU FOND JOMELET,B025,55150,55071,Brandeville,55,,,55071000ZI0225,,,,,,,,,,,,,0,,,,,BT,taillis simples,,,1570,5.305314,49.377855
2020-767502,2020-05-14,000001,Vente,98600,20,B,GR GRAND RUE,0035,55150,55071,Brandeville,55,,,550710000B1012,,,,,,,,,,,,,0,1,Maison,106,3,S,sols,,,530,5.302798,49.392176
2020-767502,2020-05-14,000001,Vente,98600,,,BRANDEVILLE,B003,55150,55071,Brandeville,55,,,550710000B1013,,,,,,,,,,,,,0,,,,,S,sols,,,485,5.302739,49.392256
2020-767604,2020-05-28,000002,Vente,6500,,,PURCHIPRE,B078,55150,55071,Brandeville,55,,,550710000B1329,,,,,,,,,,,,,0,,,,,T,terres,,,170,5.307058,49.389972
2020-767604,2020-05-28,000002,Vente,6500,,,PETITE VILLE,B063,55150,55071,Brandeville,55,,,550710000B3370,,,,,,,,,,,,,0,,,,,T,terres,,,278,5.306971,49.389864
2020-767604,2020-05-28,000002,Vente,6500,,,PETITE VILLE,B063,55150,55071,Brandeville,55,,,550710000B3373,,,,,,,,,,,,,0,,,,,S,sols,,,98,5.306893,49.389721
2020-767687,2020-06-05,000001,Vente,8500,10,B,RTE DE MURVAUX,0055,55150,55071,Brandeville,55,,,550710000B1072,,,,,,,,,,,,,0,3,Dépendance,,0,S,sols,,,61,5.304948,49.395187
2020-767691,2020-06-05,000001,Vente,400,,,LES PLANTES,B072,55150,55071,Brandeville,55,,,550710000B2233,,,,,,,,,,,,,0,,,,,T,terres,,,260,5.304372,49.398326
2020-767701,2020-06-18,000001,Vente,54775,,,JOSELLES,B047,55150,55071,Brandeville,55,,,55071000ZH0058,,,,,,,,,,,,,0,,,,,P,prés,,,2870,5.321143,49.395759
2020-767884,2020-07-28,000001,Vente,27000,,,LES GRANDS PATIS,B037,55150,55071,Brandeville,55,,,550710000B1463,,,,,,,,,,,,,0,,,,,T,terres,,,222,5.306317,49.394557
2020-767884,2020-07-28,000001,Vente,27000,,,LES GRANDS PATIS,B037,55150,55071,Brandeville,55,,,550710000B3362,,,,,,,,,,,,,0,,,,,VE,vergers,,,628,5.306866,49.39452
2020-767884,2020-07-28,000001,Vente,27000,,,LES GRANDS PATIS,B037,55150,55071,Brandeville,55,,,550710000B3363,,,,,,,,,,,,,0,,,,,VE,vergers,,,523,5.30639,49.394618
2020-767884,2020-07-28,000001,Vente,27000,,,LES GRANDS PATIS,B037,55150,55071,Brandeville,55,,,550710000B3366,,,,,,,,,,,,,0,,,,,L,landes,FRICH,Friche,232,5.306972,49.3946
2020-767884,2020-07-28,000001,Vente,27000,,,LES GRANDS PATIS,B037,55150,55071,Brandeville,55,,,550710000B3367,,,,,,,,,,,,,0,,,,,L,landes,FRICH,Friche,563,5.30688,49.394657
2020-767969,2020-08-06,000001,Vente,110000,3,,RUE DES PATIS,0060,55150,55071,Brandeville,55,,,550710000B1116,,,,,,,,,,,,,0,1,Maison,125,4,S,sols,,,75,5.304704,49.392219
2020-767969,2020-08-06,000001,Vente,110000,,,BRANDEVILLE,B003,55150,55071,Brandeville,55,,,550710000B1117,,,,,,,,,,,,,0,,,,,J,jardins,POTAG,Jardin potager,275,5.304865,49.392164
2020-767969,2020-08-06,000001,Vente,110000,3,B,RUE DES PATIS,0060,55150,55071,Brandeville,55,,,550710000B1118,,,,,,,,,,,,,0,3,Dépendance,,0,S,sols,,,60,5.305091,49.392131
2020-767978,2020-08-11,000001,Vente,15000,6,,RUE DU CULOT,0025,55150,55071,Brandeville,55,,,550710000B3359,,,,,,,,,,,,,0,3,Dépendance,,0,S,sols,,,188,5.304539,49.392652
2020-768191,2020-09-30,000001,Vente,4000,4,,GR GRAND RUE,0035,55150,55071,Brandeville,55,,,550710000B1027,,,,,,,,,,,,,0,1,Maison,70,4,S,sols,,,595,5.303278,49.393098
2020-768191,2020-09-30,000001,Vente,4000,4,,GR GRAND RUE,0035,55150,55071,Brandeville,55,,,550710000B1027,,,,,,,,,,,,,0,3,Dépendance,,0,S,sols,,,595,5.303278,49.393098
2020-768341,2020-10-19,000001,Vente,182000,,,PETITE VILLE,B063,55150,55071,Brandeville,55,,,550710000B1285,,,,,,,,,,,,,0,,,,,J,jardins,POTAG,Jardin potager,175,5.305754,49.388777
2020-768341,2020-10-19,000001,Vente,182000,,,PETITE VILLE,B063,55150,55071,Brandeville,55,,,550710000B1286,,,,,,,,,,,,,0,,,,,J,jardins,POTAG,Jardin potager,68,5.305838,49.388761
2020-768341,2020-10-19,000001,Vente,182000,,,PETITE VILLE,B063,55150,55071,Brandeville,55,,,550710000B1287,,,,,,,,,,,,,0,,,,,J,jardins,POTAG,Jardin potager,270,5.305684,49.388627
2020-768341,2020-10-19,000001,Vente,182000,,,PETITE VILLE,B063,55150,55071,Brandeville,55,,,550710000B1287,,,,,,,,,,,,,0,,,,,S,sols,,,140,5.305684,49.388627
2020-768341,2020-10-19,000001,Vente,182000,4,,CHE DE LA PETITE VILLE,0065,55150,55071,Brandeville,55,,,550710000B1288,,,,,,,,,,,,,0,1,Maison,106,5,S,sols,,,135,5.305556,49.388421
2020-768341,2020-10-19,000001,Vente,182000,4,,CHE DE LA PETITE VILLE,0065,55150,55071,Brandeville,55,,,550710000B1288,,,,,,,,,,,,,0,1,Maison,106,5,J,jardins,POTAG,Jardin potager,495,5.305556,49.388421
2020-768341,2020-10-19,000001,Vente,182000,,,PETITE VILLE,B063,55150,55071,Brandeville,55,,,550710000B1289,,,,,,,,,,,,,0,,,,,E,eaux,CANAL,Canal,433,5.305584,49.388164
2020-768341,2020-10-19,000001,Vente,182000,9290,,CHE DE LA PETITE VILLE,0065,55150,55071,Brandeville,55,,,550710000B1290,,,,,,,,,,,,,0,1,Maison,51,2,S,sols,,,255,5.306072,49.388068
2020-768341,2020-10-19,000001,Vente,182000,9290,,CHE DE LA PETITE VILLE,0065,55150,55071,Brandeville,55,,,550710000B1290,,,,,,,,,,,,,0,3,Dépendance,,0,S,sols,,,255,5.306072,49.388068
2020-768341,2020-10-19,000001,Vente,182000,,,PURCHIPRE,B078,55150,55071,Brandeville,55,,,550710000B1291,,,,,,,,,,,,,0,,,,,J,jardins,POTAG,Jardin potager,1944,5.306134,49.388119
2020-768341,2020-10-19,000001,Vente,182000,,,PURCHIPRE,B078,55150,55071,Brandeville,55,,,550710000B1292,,,,,,,,,,,,,0,,,,,T,terres,,,160,5.305847,49.388282
2020-768341,2020-10-19,000001,Vente,182000,,,PURCHIPRE,B078,55150,55071,Brandeville,55,,,550710000B1293,,,,,,,,,,,,,0,,,,,T,terres,,,65,5.305741,49.388392
2020-768341,2020-10-19,000001,Vente,182000,,,PURCHIPRE,B078,55150,55071,Brandeville,55,,,550710000B1294,,,,,,,,,,,,,0,,,,,T,terres,,,231,5.305956,49.388309
2020-768341,2020-10-19,000001,Vente,182000,,,PURCHIPRE,B078,55150,55071,Brandeville,55,,,550710000B1295,,,,,,,,,,,,,0,,,,,T,terres,,,160,5.30588,49.388411
2020-768341,2020-10-19,000001,Vente,182000,,,PURCHIPRE,B078,55150,55071,Brandeville,55,,,550710000B1296,,,,,,,,,,,,,0,,,,,T,terres,,,520,5.306103,49.388406
2020-768341,2020-10-19,000001,Vente,182000,,,PURCHIPRE,B078,55150,55071,Brandeville,55,,,550710000B1297,,,,,,,,,,,,,0,,,,,T,terres,,,198,5.306671,49.388153
2020-768341,2020-10-19,000001,Vente,182000,,,PURCHIPRE,B078,55150,55071,Brandeville,55,,,550710000B1298,,,,,,,,,,,,,0,,,,,T,terres,,,682,5.306729,49.388232
2020-768341,2020-10-19,000001,Vente,182000,,,PURCHIPRE,B078,55150,55071,Brandeville,55,,,550710000B1299,,,,,,,,,,,,,0,,,,,T,terres,,,329,5.306177,49.388482
2020-768341,2020-10-19,000001,Vente,182000,,,PURCHIPRE,B078,55150,55071,Brandeville,55,,,550710000B1300,,,,,,,,,,,,,0,,,,,T,terres,,,234,5.305931,49.38851
2020-768341,2020-10-19,000001,Vente,182000,,,PURCHIPRE,B078,55150,55071,Brandeville,55,,,550710000B1301,,,,,,,,,,,,,0,,,,,T,terres,,,1215,5.306585,49.388415
2020-768341,2020-10-19,000001,Vente,182000,,,PURCHIPRE,B078,55150,55071,Brandeville,55,,,550710000B3230,,,,,,,,,,,,,0,,,,,J,jardins,POTAG,Jardin potager,310,5.305815,49.388202
2020-768341,2020-10-19,000001,Vente,182000,,,PURCHIPRE,B078,55150,55071,Brandeville,55,,,550710000B3231,,,,,,,,,,,,,0,,,,,S,sols,,,38,5.306161,49.388
2020-768341,2020-10-19,000001,Vente,182000,,,PURCHIPRE,B078,55150,55071,Brandeville,55,,,55071000ZI0067,,,,,,,,,,,,,0,,,,,P,prés,,,870,5.306971,49.3887
2020-768341,2020-10-19,000001,Vente,182000,,,PURCHIPRE,B078,55150,55071,Brandeville,55,,,55071000ZI0068,,,,,,,,,,,,,0,,,,,P,prés,,,3830,5.306866,49.388519
2020-768341,2020-10-19,000001,Vente,182000,,,LES AUNELLES,B001,55150,55071,Brandeville,55,,,55071000ZI0090,,,,,,,,,,,,,0,,,,,T,terres,,,1880,5.30597,49.387841
2020-768343,2020-10-19,000001,Vente,30000,14,,GR GRAND RUE,0035,55150,55071,Brandeville,55,,,550710000B1020,,,,,,,,,,,,,0,1,Maison,50,2,S,sols,,,695,5.303032,49.392585
2020-768405,2020-11-03,000001,Vente,1225,,,LA VAUX JOBY,B088,55150,55071,Brandeville,55,,,550710000C0454,,,,,,,,,,,,,0,,,,,B,bois,,,24,5.278878,49.380949
2020-768405,2020-11-03,000001,Vente,1225,,,LA VAUX JOBY,B088,55150,55071,Brandeville,55,,,550710000C0454,,,,,,,,,,,,,0,,,,,BT,taillis simples,,,1206,5.278878,49.380949
2020-768405,2020-11-03,000001,Vente,1225,,,LA CARPIERE,B004,55150,55071,Brandeville,55,,,550710000C0846,,,,,,,,,,,,,0,,,,,BT,taillis simples,,,1459,5.30339,49.382853
2020-768405,2020-11-03,000001,Vente,1225,,,LA CARPIERE,B004,55150,55071,Brandeville,55,,,550710000C0846,,,,,,,,,,,,,0,,,,,B,bois,,,29,5.30339,49.382853
2020-768405,2020-11-03,000001,Vente,1225,,,LA CHEMINEE,B012,55150,55071,Brandeville,55,,,550710000C1140,,,,,,,,,,,,,0,,,,,BT,taillis simples,,,1034,5.307491,49.378973
2020-768405,2020-11-03,000001,Vente,1225,,,LA CHEMINEE,B012,55150,55071,Brandeville,55,,,550710000C1140,,,,,,,,,,,,,0,,,,,B,bois,,,21,5.307491,49.378973
2020-768405,2020-11-03,000001,Vente,1225,,,LA CHEMINEE,B012,55150,55071,Brandeville,55,,,550710000C1141,,,,,,,,,,,,,0,,,,,B,bois,,,24,5.307505,49.378871
2020-768405,2020-11-03,000001,Vente,1225,,,LA CHEMINEE,B012,55150,55071,Brandeville,55,,,550710000C1141,,,,,,,,,,,,,0,,,,,BT,taillis simples,,,1201,5.307505,49.378871
2020-768405,2020-11-03,000001,Vente,1225,,,SARELEPUITS,B083,55150,55071,Brandeville,55,,,550710000C1391,,,,,,,,,,,,,0,,,,,BT,taillis simples,,,1118,5.286335,49.369402
2020-768405,2020-11-03,000001,Vente,1225,,,SARELEPUITS,B083,55150,55071,Brandeville,55,,,550710000C1391,,,,,,,,,,,,,0,,,,,B,bois,,,22,5.286335,49.369402
2020-768405,2020-11-03,000001,Vente,1225,,,SARELEPUITS,B083,55150,55071,Brandeville,55,,,550710000C1399,,,,,,,,,,,,,0,,,,,BT,taillis simples,,,2088,5.285442,49.370623
2020-768405,2020-11-03,000001,Vente,1225,,,SARELEPUITS,B083,55150,55071,Brandeville,55,,,550710000C1399,,,,,,,,,,,,,0,,,,,B,bois,,,42,5.285442,49.370623
2020-768405,2020-11-03,000001,Vente,1225,,,SARELEPUITS,B083,55150,55071,Brandeville,55,,,550710000C1404,,,,,,,,,,,,,0,,,,,BT,taillis simples,,,1853,5.286825,49.371165
2020-768405,2020-11-03,000001,Vente,1225,,,SARELEPUITS,B083,55150,55071,Brandeville,55,,,550710000C1404,,,,,,,,,,,,,0,,,,,B,bois,,,37,5.286825,49.371165
2020-768498,2020-11-06,000001,Vente,50000,17,,GR GRAND RUE,0035,55150,55071,Brandeville,55,,,550710000B1102,,,,,,,,,,,,,0,1,Maison,111,5,S,sols,,,367,5.304508,49.393285
2020-769946,2020-12-11,000001,Vente,8000,36,,GR GRAND RUE,0035,55150,55071,Brandeville,55,,,550710000B0987,,,,,,,,,,,,,0,1,Maison,68,3,S,sols,,,565,5.302711,49.390832
2020-770215,2020-12-17,000001,Vente,68500,45,,GR GRAND RUE,0035,55150,55071,Brandeville,55,,,550710000B3343,,,,,,,,,,,,,0,1,Maison,92,4,S,sols,,,363,5.303375,49.391054
2020-770215,2020-12-17,000001,Vente,68500,45,,GR GRAND RUE,0035,55150,55071,Brandeville,55,,,550710000B3343,,,,,,,,,,,,,0,3,Dépendance,,0,S,sols,,,363,5.303375,49.391054
2020-770215,2020-12-17,000001,Vente,68500,,,BRANDEVILLE,B003,55150,55071,Brandeville,55,,,550710000B3347,,,,,,,,,,,,,0,,,,,J,jardins,POTAG,Jardin potager,831,5.303854,49.390967
