id_mutation,date_mutation,numero_disposition,nature_mutation,valeur_fonciere,adresse_numero,adresse_suffixe,adresse_nom_voie,adresse_code_voie,code_postal,code_commune,nom_commune,code_departement,ancien_code_commune,ancien_nom_commune,id_parcelle,ancien_id_parcelle,numero_volume,lot1_numero,lot1_surface_carrez,lot2_numero,lot2_surface_carrez,lot3_numero,lot3_surface_carrez,lot4_numero,lot4_surface_carrez,lot5_numero,lot5_surface_carrez,nombre_lots,code_type_local,type_local,surface_reelle_bati,nombre_pieces_principales,code_nature_culture,nature_culture,code_nature_culture_speciale,nature_culture_speciale,surface_terrain,longitude,latitude
2020-767383,2020-03-06,000001,Vente,70000,12,,RUE HAUTE,0015,55100,55321,Marre,55,,,553210000A1012,,,,,,,,,,,,,0,1,Maison,60,4,S,sols,,,1365,5.299117,49.20929
2020-767383,2020-03-06,000001,Vente,70000,12,,RUE HAUTE,0015,55100,55321,Marre,55,,,553210000A1012,,,,,,,,,,,,,0,1,Maison,60,4,VE,vergers,,,90,5.299117,49.20929
2020-767575,2020-06-04,000001,Vente,155000,5,,RUE DU PARGE,0025,55100,55321,Marre,55,,,553210000A0887,,,,,,,,,,,,,0,1,Maison,126,4,S,sols,,,689,5.300672,49.211482
2020-767575,2020-06-04,000001,Vente,155000,,,LE VILLAGE,B056,55100,55321,Marre,55,,,553210000A1027,,,,,,,,,,,,,0,,,,,S,sols,,,15,5.300645,49.211615
2020-767782,2020-06-29,000002,Vente,25000,,,LE DOMAINE DE BAMONT,B029,55100,55321,Marre,55,,,553210000B0627,,,,,,,,,,,,,0,,,,,J,jardins,POTAG,Jardin potager,2495,5.316269,49.189997
2020-767782,2020-06-29,000002,Vente,25000,9038,,LE DOMAINE DE BAMONT,B029,55100,55321,Marre,55,,,553210000B0629,,,,,,,,,,,,,0,1,Maison,176,3,S,sols,,,2299,5.316144,49.190111
2020-767782,2020-06-29,000002,Vente,25000,9038,,LE DOMAINE DE BAMONT,B029,55100,55321,Marre,55,,,553210000B0629,,,,,,,,,,,,,0,1,Maison,143,3,S,sols,,,2299,5.316144,49.190111
2020-767782,2020-06-29,000002,Vente,25000,9038,,LE DOMAINE DE BAMONT,B029,55100,55321,Marre,55,,,553210000B0629,,,,,,,,,,,,,0,1,Maison,173,4,S,sols,,,2299,5.316144,49.190111
2020-768250,2020-09-21,000001,Vente,257.6,,,LE CANAL DU MOULIN,B017,55100,55321,Marre,55,,,55321000ZB0110,,,,,,,,,,,,,0,,,,,J,jardins,POTAG,Jardin potager,323,5.297285,49.209974
2020-768250,2020-09-21,000001,Vente,257.6,,,LE CANAL DU MOULIN,B017,55100,55321,Marre,55,,,55321000ZB0110,,,,,,,,,,,,,0,,,,,P,prés,,,321,5.297285,49.209974
