id_mutation,date_mutation,numero_disposition,nature_mutation,valeur_fonciere,adresse_numero,adresse_suffixe,adresse_nom_voie,adresse_code_voie,code_postal,code_commune,nom_commune,code_departement,ancien_code_commune,ancien_nom_commune,id_parcelle,ancien_id_parcelle,numero_volume,lot1_numero,lot1_surface_carrez,lot2_numero,lot2_surface_carrez,lot3_numero,lot3_surface_carrez,lot4_numero,lot4_surface_carrez,lot5_numero,lot5_surface_carrez,nombre_lots,code_type_local,type_local,surface_reelle_bati,nombre_pieces_principales,code_nature_culture,nature_culture,code_nature_culture_speciale,nature_culture_speciale,surface_terrain,longitude,latitude
2020-768740,2020-02-19,000001,Vente,137000,38,,RUE ERNEST CHAUDRON,0010,55250,55532,Vaubecourt,55,,,55532000AN0165,,,,,,,,,,,,,0,1,Maison,40,2,S,sols,,,1170,5.114337,48.936841
2020-768740,2020-02-19,000001,Vente,137000,,,LE VILLAGE,B198,55250,55532,Vaubecourt,55,,,55532000AN0166,,,,,,,,,,,,,0,,,,,VE,vergers,,,2810,5.115292,48.936722
2020-768764,2020-03-13,000001,Vente,1710,,,LIGNAUMONT,B117,55250,55532,Vaubecourt,55,,,555320000D0131,,,,,,,,,,,,,0,,,,,B,bois,,,1852,5.099229,48.934164
2020-768764,2020-03-13,000001,Vente,1710,,,LIGNAUMONT,B117,55250,55532,Vaubecourt,55,,,555320000D0131,,,,,,,,,,,,,0,,,,,BS,taillis sous futaie,,,12398,5.099229,48.934164
2020-768820,2020-04-14,000001,Vente,115000,32,,RUE DE BOURGOGNE,0006,55250,55532,Vaubecourt,55,,,55532000ZK0023,,,,,,,,,,,,,0,1,Maison,65,3,S,sols,,,475,5.105317,48.934397
2020-768820,2020-04-14,000001,Vente,115000,32,,RUE DE BOURGOGNE,0006,55250,55532,Vaubecourt,55,,,55532000ZK0023,,,,,,,,,,,,,0,1,Maison,65,3,VE,vergers,,,1835,5.105317,48.934397
2020-768853,2020-04-28,000001,Vente,300,,,SUR WOIGNEE,B211,55250,55532,Vaubecourt,55,,,555320000D0231,,,,,,,,,,,,,0,,,,,B,bois,,,162,5.079756,48.943491
2020-768853,2020-04-28,000001,Vente,300,,,SUR WOIGNEE,B211,55250,55532,Vaubecourt,55,,,555320000D0231,,,,,,,,,,,,,0,,,,,BS,taillis sous futaie,,,1088,5.079756,48.943491
2020-768853,2020-04-28,000001,Vente,300,,,SUR WOIGNEE,B211,55250,55532,Vaubecourt,55,,,555320000D0232,,,,,,,,,,,,,0,,,,,B,bois,,,192,5.079299,48.94357
2020-768853,2020-04-28,000001,Vente,300,,,SUR WOIGNEE,B211,55250,55532,Vaubecourt,55,,,555320000D0232,,,,,,,,,,,,,0,,,,,BS,taillis sous futaie,,,1288,5.079299,48.94357
2020-768854,2020-04-24,000001,Vente,54000,28,,RUE GRANDE,0024,55250,55532,Vaubecourt,55,,,55532000AN0518,,,,,,,,,,,,,0,1,Maison,90,4,VE,vergers,,,992,5.109317,48.932487
2020-768854,2020-04-24,000001,Vente,54000,28,,RUE GRANDE,0024,55250,55532,Vaubecourt,55,,,55532000AN0518,,,,,,,,,,,,,0,1,Maison,90,4,S,sols,,,1180,5.109317,48.932487
2020-769031,2020-07-03,000001,Vente,215000,,,GRANDE PIECE,B215,55250,55532,Vaubecourt,55,,,55532000ZI0017,,,,,,,,,,,,,0,,,,,BS,taillis sous futaie,,,3500,5.100869,48.926779
2020-769031,2020-07-03,000001,Vente,215000,,,GRANDE PIECE,B215,55250,55532,Vaubecourt,55,,,55532000ZI0017,,,,,,,,,,,,,0,,,,,P,prés,,,386,5.100869,48.926779
2020-769031,2020-07-03,000001,Vente,215000,,,GRANDE PIECE,B215,55250,55532,Vaubecourt,55,,,55532000ZI0017,,,,,,,,,,,,,0,,,,,P,prés,,,7771,5.100869,48.926779
2020-769031,2020-07-03,000001,Vente,215000,,,CLOS DU MOULIN,B038,55250,55532,Vaubecourt,55,,,55532000ZK0042,,,,,,,,,,,,,0,,,,,P,prés,,,6397,5.100256,48.927538
2020-769300,2020-09-15,000001,Vente,2482.08,,,AUX ACCRUES,B001,55250,55532,Vaubecourt,55,,,555320000D0321,,,,,,,,,,,,,0,,,,,BS,taillis sous futaie,,,17996,5.079394,48.946073
2020-769300,2020-09-15,000001,Vente,2482.08,,,AUX ACCRUES,B001,55250,55532,Vaubecourt,55,,,555320000D0321,,,,,,,,,,,,,0,,,,,B,bois,,,2688,5.079394,48.946073
2020-769543,2020-10-22,000001,Vente,27000,3,,RUE DES TROIS FRERES RULOT,0050,55250,55532,Vaubecourt,55,,,55532000AN0374,,,,,,,,,,,,,0,3,Dépendance,,0,S,sols,,,850,5.113335,48.934208
2020-769543,2020-10-22,000001,Vente,27000,3,,RUE DES TROIS FRERES RULOT,0050,55250,55532,Vaubecourt,55,,,55532000AN0374,,,,,,,,,,,,,0,1,Maison,57,4,S,sols,,,850,5.113335,48.934208
