id_mutation,date_mutation,numero_disposition,nature_mutation,valeur_fonciere,adresse_numero,adresse_suffixe,adresse_nom_voie,adresse_code_voie,code_postal,code_commune,nom_commune,code_departement,ancien_code_commune,ancien_nom_commune,id_parcelle,ancien_id_parcelle,numero_volume,lot1_numero,lot1_surface_carrez,lot2_numero,lot2_surface_carrez,lot3_numero,lot3_surface_carrez,lot4_numero,lot4_surface_carrez,lot5_numero,lot5_surface_carrez,nombre_lots,code_type_local,type_local,surface_reelle_bati,nombre_pieces_principales,code_nature_culture,nature_culture,code_nature_culture_speciale,nature_culture_speciale,surface_terrain,longitude,latitude
2020-788737,2020-01-09,000001,Vente,40000,,,LA GREE,B863,56800,56006,Augan,56,,,56006000YB0003,,,,,,,,,,,,,0,,,,,P,prés,,,7770,-2.327928,47.902826
2020-788737,2020-01-09,000001,Vente,40000,5351,,GERGUY,B379,56800,56006,Augan,56,,,56006000YB0004,,,,,,,,,,,,,0,1,Maison,46,1,T,terres,,,7624,-2.326285,47.902833
2020-788737,2020-01-09,000001,Vente,40000,5351,,GERGUY,B379,56800,56006,Augan,56,,,56006000YB0004,,,,,,,,,,,,,0,1,Maison,46,1,P,prés,,,8773,-2.326285,47.902833
2020-788737,2020-01-09,000001,Vente,40000,5351,,GERGUY,B379,56800,56006,Augan,56,,,56006000YB0004,,,,,,,,,,,,,0,1,Maison,46,1,P,prés,,,8000,-2.326285,47.902833
2020-788737,2020-01-09,000001,Vente,40000,5351,,GERGUY,B379,56800,56006,Augan,56,,,56006000YB0004,,,,,,,,,,,,,0,1,Maison,46,1,S,sols,,,4693,-2.326285,47.902833
2020-788799,2020-01-21,000001,Vente,4540,,,LES GAUBUS,B376,56800,56006,Augan,56,,,56006000YI0155,,,,,,,,,,,,,0,,,,,S,sols,,,987,-2.290593,47.922196
2020-788800,2020-01-21,000002,Vente,,,,LES GAUBUS,B376,56800,56006,Augan,56,,,56006000YI0155,,,,,,,,,,,,,0,,,,,S,sols,,,987,-2.290593,47.922196
2020-788845,2020-01-29,000001,Vente,46500,3,,RUE DU FOUR,0043,56800,56006,Augan,56,,,56006000AB0214,,,,,,,,,,,,,0,1,Maison,118,2,S,sols,,,49,-2.278493,47.918983
2020-788860,2020-01-20,000001,Vente,3000,,,LES VAUX,B742,56800,56006,Augan,56,,,56006000ZT0124,,,,,,,,,,,,,0,,,,,T,terres,,,5947,-2.255067,47.891284
2020-788860,2020-01-20,000001,Vente,3000,,,LES VAUX,B742,56800,56006,Augan,56,,,56006000ZT0124,,,,,,,,,,,,,0,,,,,BT,taillis simples,,,3371,-2.255067,47.891284
2020-788860,2020-01-20,000001,Vente,3000,,,LES VAUX,B742,56800,56006,Augan,56,,,56006000ZT0124,,,,,,,,,,,,,0,,,,,P,prés,,,2094,-2.255067,47.891284
2020-788889,2020-02-05,000002,Vente,4000,29,,RUE DE CARADEC,0032,56800,56006,Augan,56,,,56006000AB0759,,,,,,,,,,,,,0,,,,,S,sols,,,215,-2.279154,47.918254
2020-788972,2020-02-14,000002,Vente,36000,,,RUE DE LA BARRIERE,0013,56800,56006,Augan,56,,,56006000YH0176,,,,,,,,,,,,,0,,,,,T,terres,,,805,-2.28286,47.918521
2020-788980,2020-01-24,000001,Vente,145000,5028,,LE COL,B278,56800,56006,Augan,56,,,56006000ZB0010,,,,,,,,,,,,,0,1,Maison,78,1,S,sols,,,520,-2.287619,47.928326
2020-789104,2020-02-27,000003,Vente,18000,,,LES CHAMPS BREHAUT,B132,56800,56006,Augan,56,,,56006000ZW0084,,,,,,,,,,,,,0,,,,,S,sols,,,580,-2.277438,47.895215
2020-789104,2020-02-27,000003,Vente,18000,,,LES CHAMPS BREHAUT,B132,56800,56006,Augan,56,,,56006000ZW0086,,,,,,,,,,,,,0,,,,,T,terres,,,840,-2.277064,47.894224
2020-789104,2020-02-27,000003,Vente,18000,,,LES CHAMPS BREHAUT,B132,56800,56006,Augan,56,,,56006000ZW0086,,,,,,,,,,,,,0,,,,,T,terres,,,840,-2.277064,47.894224
2020-789131,2020-02-20,000001,Vente,80000,3,A,LA VILLE CADIO,B748,56800,56006,Augan,56,,,56006000ZC0023,,,,,,,,,,,,,0,1,Maison,30,1,S,sols,,,200,-2.265183,47.93067
2020-789131,2020-02-20,000001,Vente,80000,3,,LA VILLE CADIO,B748,56800,56006,Augan,56,,,56006000ZC0024,,,,,,,,,,,,,0,1,Maison,55,4,S,sols,,,320,-2.26527,47.930645
2020-789131,2020-02-20,000001,Vente,80000,3,B,LA VILLE CADIO,B748,56800,56006,Augan,56,,,56006000ZC0123,,,,,,,,,,,,,0,3,Dépendance,,0,S,sols,,,155,-2.265335,47.930855
2020-789131,2020-02-20,000001,Vente,80000,,,LE HAUT DE LA BANDE,B411,56800,56006,Augan,56,,,56006000ZE0051,,,,,,,,,,,,,0,,,,,T,terres,,,770,-2.265338,47.929989
2020-789131,2020-02-20,000001,Vente,80000,,,LE HAUT DE LA BANDE,B411,56800,56006,Augan,56,,,56006000ZE0051,,,,,,,,,,,,,0,,,,,S,sols,,,190,-2.265338,47.929989
2020-789131,2020-02-20,000001,Vente,80000,,,LE HAUT DE LA BANDE,B411,56800,56006,Augan,56,,,56006000ZE0161,,,,,,,,,,,,,0,,,,,T,terres,,,412,-2.264963,47.929458
2020-789242,2020-03-09,000001,Vente,107200,7,,LA VILLE FIEF,B758,56800,56006,Augan,56,,,56006000ZC0038,,,,,,,,,,,,,0,1,Maison,70,4,S,sols,,,440,-2.272319,47.926718
2020-789242,2020-03-09,000001,Vente,107200,7,,LA VILLE FIEF,B758,56800,56006,Augan,56,,,56006000ZC0038,,,,,,,,,,,,,0,1,Maison,70,4,T,terres,,,1340,-2.272319,47.926718
2020-789276,2020-03-12,000002,Echange,1000,,,LES GARENNES,B857,56800,56006,Augan,56,,,56006000ZD0148,,,,,,,,,,,,,0,,,,,P,prés,,,3370,-2.261478,47.938105
2020-789427,2020-05-20,000001,Vente,78000,,,MALABOEUF,B468,56800,56006,Augan,56,,,56006000AB0628,,,,,,,,,,,,,0,,,,,P,prés,,,12,-2.280511,47.921183
2020-789427,2020-05-20,000001,Vente,78000,,,MALABOEUF,B468,56800,56006,Augan,56,,,56006000AB0752,,,,,,,,,,,,,0,,,,,P,prés,,,367,-2.280436,47.920929
2020-789427,2020-05-20,000001,Vente,78000,,,MALABOEUF,B468,56800,56006,Augan,56,,,56006000AB0753,,,,,,,,,,,,,0,,,,,P,prés,,,326,-2.280159,47.920977
2020-789427,2020-05-20,000001,Vente,78000,6,,RUE DU STADE,0063,56800,56006,Augan,56,,,56006000AB0754,,,,,,,,,,,,,0,1,Maison,87,4,S,sols,,,303,-2.280505,47.921073
2020-789427,2020-05-20,000001,Vente,78000,,,RUE DU STADE,0063,56800,56006,Augan,56,,,56006000AB0755,,,,,,,,,,,,,0,,,,,S,sols,,,173,-2.280245,47.921077
2020-789427,2020-05-20,000001,Vente,78000,,,MALABOEUF,B468,56800,56006,Augan,56,,,56006000AB0756,,,,,,,,,,,,,0,,,,,S,sols,,,104,-2.280497,47.92117
2020-789427,2020-05-20,000001,Vente,78000,,,MALABOEUF,B468,56800,56006,Augan,56,,,56006000AB0757,,,,,,,,,,,,,0,,,,,J,jardins,,,116,-2.280144,47.921097
2020-789561,2020-06-09,000001,Vente,41790,5162,,LE PONT CHARRIE,B567,56800,56006,Augan,56,,,56006000ZN0032,,,,,,,,,,,,,0,1,Maison,52,5,S,sols,,,270,-2.236476,47.89917
2020-789561,2020-06-09,000001,Vente,41790,5162,,LE PONT CHARRIE,B567,56800,56006,Augan,56,,,56006000ZN0032,,,,,,,,,,,,,0,1,Maison,52,5,T,terres,,,3770,-2.236476,47.89917
2020-789682,2020-06-30,000001,Vente,4524,,,LES CHAMPS DE BINIO,B805,56800,56006,Augan,56,,,56006000ZX0011,,,,,,,,,,,,,0,,,,,T,terres,,,1200,-2.300194,47.905203
2020-789682,2020-06-30,000001,Vente,4524,,,LES CHAMPS DE BINIO,B805,56800,56006,Augan,56,,,56006000ZX0012,,,,,,,,,,,,,0,,,,,T,terres,,,3980,-2.299877,47.905176
2020-789682,2020-06-30,000001,Vente,4524,,,LES CHAMPS DE BINIO,B805,56800,56006,Augan,56,,,56006000ZX0013,,,,,,,,,,,,,0,,,,,T,terres,,,1700,-2.299438,47.905135
2020-789682,2020-06-30,000001,Vente,4524,,,LA CRECHETTE,B821,56800,56006,Augan,56,,,56006000ZX0114,,,,,,,,,,,,,0,,,,,T,terres,,,8200,-2.301694,47.901763
2020-789689,2020-06-30,000001,Vente,8010,,,LES EPINETTES,B349,56800,56006,Augan,56,,,56006000YA0025,,,,,,,,,,,,,0,,,,,T,terres,,,5860,-2.297375,47.89948
2020-789689,2020-06-30,000001,Vente,8010,,,LES EPINETTES,B349,56800,56006,Augan,56,,,56006000YA0026,,,,,,,,,,,,,0,,,,,T,terres,,,3520,-2.297988,47.899187
2020-789689,2020-06-30,000001,Vente,8010,,,LA BANDE DES PLACIEUX,B787,56800,56006,Augan,56,,,56006000ZY0048,,,,,,,,,,,,,0,,,,,T,terres,,,4636,-2.29298,47.900494
2020-789689,2020-06-30,000001,Vente,8010,,,LA BANDE DES PLACIEUX,B787,56800,56006,Augan,56,,,56006000ZY0048,,,,,,,,,,,,,0,,,,,P,prés,,,7634,-2.29298,47.900494
2020-789689,2020-06-30,000001,Vente,8010,,,LA BANDE DES PLACIEUX,B787,56800,56006,Augan,56,,,56006000ZY0050,,,,,,,,,,,,,0,,,,,P,prés,,,5050,-2.29301,47.898236
2020-789760,2020-06-15,000001,Vente,47000,13,,RUE DU CLOS BILY,0038,56800,56006,Augan,56,,,56006000AB0427,,,,,,,,,,,,,0,1,Maison,106,3,S,sols,,,92,-2.278931,47.92043
2020-789760,2020-06-15,000001,Vente,47000,,,LE BOURG,B948,56800,56006,Augan,56,,,56006000AB0558,,,,,,,,,,,,,0,,,,,S,sols,,,209,-2.278971,47.920575
2020-789786,2020-06-23,000001,Vente,60000,,,LE DOMAINE,B330,56800,56006,Augan,56,,,56006000YB0018,,,,,,,,,,,,,0,,,,,T,terres,,,11065,-2.321443,47.902931
2020-789786,2020-06-23,000001,Vente,60000,,,LE DOMAINE,B330,56800,56006,Augan,56,,,56006000YB0018,,,,,,,,,,,,,0,,,,,T,terres,,,11065,-2.321443,47.902931
2020-789786,2020-06-23,000001,Vente,60000,,,BANDE DU MOULIN,B045,56800,56006,Augan,56,,,56006000YB0051,,,,,,,,,,,,,0,,,,,P,prés,,,7050,-2.316929,47.901455
2020-789786,2020-06-23,000001,Vente,60000,,,BANDE DU MOULIN,B045,56800,56006,Augan,56,,,56006000YB0051,,,,,,,,,,,,,0,,,,,T,terres,,,6228,-2.316929,47.901455
2020-789786,2020-06-23,000001,Vente,60000,,,BANDE DU MOULIN,B045,56800,56006,Augan,56,,,56006000YB0051,,,,,,,,,,,,,0,,,,,P,prés,,,8226,-2.316929,47.901455
2020-789786,2020-06-23,000001,Vente,60000,,,BANDE DU MOULIN,B045,56800,56006,Augan,56,,,56006000YB0051,,,,,,,,,,,,,0,,,,,T,terres,,,19036,-2.316929,47.901455
2020-789786,2020-06-23,000001,Vente,60000,,,LES GRANDES CLAIES,B861,56800,56006,Augan,56,,,56006000YB0063,,,,,,,,,,,,,0,,,,,T,terres,,,7805,-2.323934,47.898951
2020-789786,2020-06-23,000001,Vente,60000,,,LES GRANDES CLAIES,B861,56800,56006,Augan,56,,,56006000YB0063,,,,,,,,,,,,,0,,,,,T,terres,,,15611,-2.323934,47.898951
2020-789786,2020-06-23,000001,Vente,60000,,,LES GRANDES CLAIES,B861,56800,56006,Augan,56,,,56006000YB0063,,,,,,,,,,,,,0,,,,,P,prés,,,11924,-2.323934,47.898951
2020-789951,2020-07-29,000001,Vente,99500,4,,BELLE ALOUETTE,B064,56800,56006,Augan,56,,,56006000ZV0199,,,,,,,,,,,,,0,1,Maison,100,4,S,sols,,,500,-2.285437,47.883037
2020-789951,2020-07-29,000001,Vente,99500,4,,BELLE ALOUETTE,B064,56800,56006,Augan,56,,,56006000ZV0199,,,,,,,,,,,,,0,1,Maison,100,4,T,terres,,,1004,-2.285437,47.883037
2020-789997,2020-07-27,000001,Vente,1600,,,LE CLOS DE LA VILLE GOURIO,B820,56800,56006,Augan,56,,,56006000ZL0102,,,,,,,,,,,,,0,,,,,E,eaux,,,1411,-2.225618,47.902162
2020-789997,2020-07-27,000001,Vente,1600,,,LE CLOS DE LA VILLE GOURIO,B820,56800,56006,Augan,56,,,56006000ZL0102,,,,,,,,,,,,,0,,,,,BP,peupleraies,,,10045,-2.225618,47.902162
2020-790099,2020-08-25,000001,Vente,25000,,,LE BOURG,B948,56800,56006,Augan,56,,,56006000AB0217,,,,,,,,,,,,,0,,,,,J,jardins,,,30,-2.278591,47.918742
2020-790099,2020-08-25,000001,Vente,25000,,,RUE DU FOUR,0043,56800,56006,Augan,56,,,56006000AB0645,,,,,,,,,,,,,0,,,,,S,sols,,,143,-2.278711,47.918856
2020-790101,2020-08-25,000001,Vente,57000,,,LE BOURG,B948,56800,56006,Augan,56,,,56006000AB0219,,,,,,,,,,,,,0,,,,,J,jardins,,,162,-2.278479,47.918573
2020-790101,2020-08-25,000001,Vente,57000,11,,RUE DE CARADEC,0032,56800,56006,Augan,56,,,56006000AB0286,,,,,,,,,,,,,0,1,Maison,174,6,S,sols,,,155,-2.278806,47.919036
2020-790106,2020-08-25,000001,Vente,15000,7,,RUE DU FOUR,0043,56800,56006,Augan,56,,,56006000AB0725,,,,,,,,,,,,,0,3,Dépendance,,0,S,sols,,,154,-2.2786,47.918901
2020-790134,2020-08-19,000001,Vente,1700,,,LES COURTILS,B296,56800,56006,Augan,56,,,56006000YB0083,,,,,,,,,,,,,0,,,,,T,terres,,,998,-2.327496,47.901535
2020-790134,2020-08-19,000001,Vente,1700,,,LES COURTILS,B296,56800,56006,Augan,56,,,56006000YB0083,,,,,,,,,,,,,0,,,,,P,prés,,,372,-2.327496,47.901535
2020-790146,2020-08-31,000001,Vente,100000,2,,LES TOULANS,B723,56800,56006,Augan,56,,,56006000ZX0162,,,,,,,,,,,,,0,1,Maison,121,6,S,sols,,,925,-2.28905,47.902567
2020-790146,2020-08-31,000001,Vente,100000,2,,LES TOULANS,B723,56800,56006,Augan,56,,,56006000ZX0162,,,,,,,,,,,,,0,1,Maison,121,6,T,terres,,,3855,-2.28905,47.902567
2020-790238,2020-09-15,000001,Vente,150000,9,,RUE DE LA CROIX ROUGE,0040,56800,56006,Augan,56,,,56006000YH0169,,,,,,,,,,,,,0,1,Maison,227,9,AG,terrains d'agrément,,,2043,-2.282295,47.919799
2020-790238,2020-09-15,000001,Vente,150000,9,,RUE DE LA CROIX ROUGE,0040,56800,56006,Augan,56,,,56006000YH0169,,,,,,,,,,,,,0,1,Maison,227,9,S,sols,,,1000,-2.282295,47.919799
2020-790358,2020-09-15,000001,Vente,102000,,,LA BANDE DES TOULANS,B792,56800,56006,Augan,56,,,56006000ZY0054,,,,,,,,,,,,,0,,,,,S,sols,,,120,-2.291396,47.90043
2020-790358,2020-09-15,000001,Vente,102000,5,,LES TOULANS,B723,56800,56006,Augan,56,,,56006000ZY0159,,,,,,,,,,,,,0,1,Maison,67,3,T,terres,,,3349,-2.291958,47.900201
2020-790358,2020-09-15,000001,Vente,102000,5,,LES TOULANS,B723,56800,56006,Augan,56,,,56006000ZY0159,,,,,,,,,,,,,0,1,Maison,67,3,S,sols,,,506,-2.291958,47.900201
2020-790358,2020-09-15,000001,Vente,102000,,,LA RUE DES FORGES,B914,56800,56006,Augan,56,,,56006000ZY0160,,,,,,,,,,,,,0,,,,,T,terres,,,1440,-2.2913,47.899991
2020-790424,2020-09-21,000001,Vente,105000,4,,LE POURCAUD,B570,56800,56006,Augan,56,,,56006000ZP0104,,,,,,,,,,,,,0,1,Maison,85,4,AG,terrains d'agrément,,,500,-2.258133,47.909206
2020-790424,2020-09-21,000001,Vente,105000,4,,LE POURCAUD,B570,56800,56006,Augan,56,,,56006000ZP0104,,,,,,,,,,,,,0,1,Maison,85,4,T,terres,,,1400,-2.258133,47.909206
2020-790424,2020-09-21,000001,Vente,105000,4,,LE POURCAUD,B570,56800,56006,Augan,56,,,56006000ZP0104,,,,,,,,,,,,,0,1,Maison,85,4,S,sols,,,500,-2.258133,47.909206
2020-790474,2020-09-29,000001,Vente,125000,11,,RUE DE LA POSTE,0058,56800,56006,Augan,56,,,56006000AB0369,,,,,,,,,,,,,0,1,Maison,95,3,S,sols,,,175,-2.278523,47.920019
2020-790507,2020-10-07,000001,Vente,148000,4,,IMP DES MYOSOTIS,0055,56800,56006,Augan,56,,,56006000YH0153,,,,,,,,,,,,,0,1,Maison,101,4,S,sols,,,641,-2.284612,47.919415
2020-790566,2020-10-15,000001,Vente,135000,4,,RUE DES TILLEULS,0064,56800,56006,Augan,56,,,56006000YH0051,,,,,,,,,,,,,0,1,Maison,110,5,S,sols,,,460,-2.285507,47.92025
2020-790566,2020-10-15,000001,Vente,135000,,,RUE DES TILLEULS,0064,56800,56006,Augan,56,,,56006000YH0052,,,,,,,,,,,,,0,,,,,S,sols,,,405,-2.285641,47.920218
2020-790609,2020-10-22,000001,Vente,65000,5,,RUE DE CARADEC,0032,56800,56006,Augan,56,,,56006000AB0569,,,,,,,,,,,,,0,1,Maison,72,4,S,sols,,,71,-2.278543,47.919156
2020-790662,2020-10-26,000001,Vente,3914.7,,,LES LANDES DE BONMORE,B871,56800,56006,Augan,56,,,56006000ZP0063,,,,,,,,,,,,,0,,,,,T,terres,,,3340,-2.253871,47.903172
2020-790662,2020-10-26,000001,Vente,3914.7,,,SUR LES CLOS MARION,B818,56800,56006,Augan,56,,,56006000ZP0195,,,,,,,,,,,,,0,,,,,T,terres,,,3769,,
2020-790662,2020-10-26,000001,Vente,3914.7,,,EN DESSOUS DE LA LIGNE,B839,56800,56006,Augan,56,,,56006000ZR0062,,,,,,,,,,,,,0,,,,,P,prés,,,5940,-2.264322,47.906189
2020-790677,2020-10-20,000001,Vente,420,,,DOMAINE DE DEVANT,B334,56800,56006,Augan,56,,,56006000YI0044,,,,,,,,,,,,,0,,,,,S,sols,,,280,-2.287802,47.927998
2020-790735,2020-11-03,000001,Vente,1140,,,PATIS DE BOUSSAC,B500,56800,56006,Augan,56,,,56006000ZY0005,,,,,,,,,,,,,0,,,,,P,prés,,,1900,-2.29239,47.893368
2020-790735,2020-11-03,000001,Vente,1140,,,PATIS DE BOUSSAC,B500,56800,56006,Augan,56,,,56006000ZY0005,,,,,,,,,,,,,0,,,,,P,prés,,,1900,-2.29239,47.893368
2020-790800,2020-10-27,000001,Vente,122990,2,,RUE DES CERISIERS,0035,56800,56006,Augan,56,,,56006000YH0124,,,,,,,,,,,,,0,4,Local industriel. commercial ou assimilé,58,0,S,sols,,,844,-2.284392,47.920399
2020-790800,2020-10-27,000001,Vente,122990,2,,RUE DES CERISIERS,0035,56800,56006,Augan,56,,,56006000YH0124,,,,,,,,,,,,,0,1,Maison,40,2,S,sols,,,844,-2.284392,47.920399
2020-790853,2020-11-18,000001,Vente terrain à bâtir,19411,,,RUE DE BONNEVAL,0023,56800,56006,Augan,56,,,56006000AC0213,,,,,,,,,,,,,0,,,,,AB,terrains a bâtir,,,249,-2.280607,47.913937
2020-790853,2020-11-18,000001,Vente terrain à bâtir,19411,,,L EPINE ARMEL,B344,56800,56006,Augan,56,,,56006000ZR0220,,,,,,,,,,,,,0,,,,,AB,terrains a bâtir,,,164,-2.280442,47.913939
2020-790945,2020-11-30,000001,Vente,21000,,,BANDE DE TRULO,B027,56800,56006,Augan,56,,,56006000ZL0048,,,,,,,,,,,,,0,,,,,T,terres,,,7460,-2.228403,47.904204
2020-790945,2020-11-30,000001,Vente,21000,5660,,LA VILLE ES GOURIO,B755,56800,56006,Augan,56,,,56006000ZL0067,,,,,,,,,,,,,0,3,Dépendance,,0,S,sols,,,1192,-2.227978,47.903407
2020-790945,2020-11-30,000001,Vente,21000,5660,,LA VILLE ES GOURIO,B755,56800,56006,Augan,56,,,56006000ZL0067,,,,,,,,,,,,,0,3,Dépendance,,0,T,terres,,,4708,-2.227978,47.903407
2020-790945,2020-11-30,000001,Vente,21000,,,LE CLOS DE LA VILLE GOURIO,B820,56800,56006,Augan,56,,,56006000ZL0075,,,,,,,,,,,,,0,,,,,P,prés,,,7970,-2.226132,47.901015
2020-790945,2020-11-30,000001,Vente,21000,,,LE CLOS DE LA VILLE GOURIO,B820,56800,56006,Augan,56,,,56006000ZL0075,,,,,,,,,,,,,0,,,,,T,terres,,,3220,-2.226132,47.901015
2020-790945,2020-11-30,000001,Vente,21000,,,LE CLOS DE LA VILLE GOURIO,B820,56800,56006,Augan,56,,,56006000ZL0075,,,,,,,,,,,,,0,,,,,P,prés,,,7970,-2.226132,47.901015
2020-790998,2020-12-14,000001,Vente,144000,1,,RUE DU BOIS DU LOUP,0021,56800,56006,Augan,56,,,56006000AB0385,,,,,,,,,,,,,0,1,Maison,192,7,S,sols,,,585,-2.277211,47.920117
2020-790998,2020-12-14,000001,Vente,144000,1,,RUE DU BOIS DU LOUP,0021,56800,56006,Augan,56,,,56006000AB0385,,,,,,,,,,,,,0,3,Dépendance,,0,S,sols,,,585,-2.277211,47.920117
