id_mutation,date_mutation,numero_disposition,nature_mutation,valeur_fonciere,adresse_numero,adresse_suffixe,adresse_nom_voie,adresse_code_voie,code_postal,code_commune,nom_commune,code_departement,ancien_code_commune,ancien_nom_commune,id_parcelle,ancien_id_parcelle,numero_volume,lot1_numero,lot1_surface_carrez,lot2_numero,lot2_surface_carrez,lot3_numero,lot3_surface_carrez,lot4_numero,lot4_surface_carrez,lot5_numero,lot5_surface_carrez,nombre_lots,code_type_local,type_local,surface_reelle_bati,nombre_pieces_principales,code_nature_culture,nature_culture,code_nature_culture_speciale,nature_culture_speciale,surface_terrain,longitude,latitude
2020-785379,2020-01-29,000001,Vente,48000,16,,RUE DES TILLEULS,0236,56330,56031,Camors,56,,,56031000ZO0549,,,,,,,,,,,,,0,,,,,AB,terrains a bâtir,,,1082,-2.997103,47.833647
2020-785384,2020-01-02,000001,Vente,120000,14,,RUE PRINCIPALE,0207,56330,56031,Camors,56,,,56031000ZC0258,,,,,,,,,,,,,0,4,Local industriel. commercial ou assimilé,249,0,S,sols,,,414,-3.000469,47.847424
2020-785384,2020-01-02,000001,Vente,120000,14,,RUE PRINCIPALE,0207,56330,56031,Camors,56,,,56031000ZC0258,,,,,,,,,,,,,0,4,Local industriel. commercial ou assimilé,365,0,S,sols,,,414,-3.000469,47.847424
2020-785391,2020-01-03,000001,Vente,287000,5329,,COSCAMORS,B024,56330,56031,Camors,56,,,56031000ZT0195,,,,,,,,,,,,,0,1,Maison,230,5,BR,futaies résineuses,,,3540,-2.984818,47.814387
2020-785391,2020-01-03,000001,Vente,287000,5329,,COSCAMORS,B024,56330,56031,Camors,56,,,56031000ZT0195,,,,,,,,,,,,,0,1,Maison,230,5,T,terres,,,5808,-2.984818,47.814387
2020-785391,2020-01-03,000001,Vente,287000,5329,,COSCAMORS,B024,56330,56031,Camors,56,,,56031000ZT0195,,,,,,,,,,,,,0,1,Maison,230,5,BR,futaies résineuses,,,1986,-2.984818,47.814387
2020-785391,2020-01-03,000001,Vente,287000,5329,,COSCAMORS,B024,56330,56031,Camors,56,,,56031000ZT0195,,,,,,,,,,,,,0,1,Maison,230,5,S,sols,,,900,-2.984818,47.814387
2020-785437,2020-01-11,000001,Vente,237000,6185,,KERROC H,B209,56330,56031,Camors,56,,,56031000ZH0153,,,,,,,,,,,,,0,1,Maison,150,5,L,landes,,,1226,-2.964875,47.851642
2020-785437,2020-01-11,000001,Vente,237000,6185,,KERROC H,B209,56330,56031,Camors,56,,,56031000ZH0153,,,,,,,,,,,,,0,1,Maison,150,5,BR,futaies résineuses,,,5000,-2.964875,47.851642
2020-785437,2020-01-11,000001,Vente,237000,6185,,KERROC H,B209,56330,56031,Camors,56,,,56031000ZH0153,,,,,,,,,,,,,0,1,Maison,150,5,T,terres,,,900,-2.964875,47.851642
2020-785437,2020-01-11,000001,Vente,237000,6185,,KERROC H,B209,56330,56031,Camors,56,,,56031000ZH0153,,,,,,,,,,,,,0,1,Maison,150,5,S,sols,,,1600,-2.964875,47.851642
2020-785516,2020-01-15,000001,Vente,184200,56,,RUE DU PETIT BOIS,0211,56330,56031,Camors,56,,,56031000ZC0189,,,,,,,,,,,,,0,1,Maison,95,4,S,sols,,,700,-3.011107,47.845857
2020-785551,2020-01-29,000001,Vente,155000,5885,,PONT FAU,B646,56330,56031,Camors,56,,,56031000ZV0134,,,,,,,,,,,,,0,1,Maison,121,5,S,sols,,,694,,
2020-785651,2020-01-31,000001,Vente,22000,5450,,LANN ER VENGLER,C126,56330,56031,Camors,56,,,56031000ZR0033,,,,,,,,,,,,,0,1,Maison,33,1,S,sols,,,129,-3.012923,47.820644
2020-785651,2020-01-31,000001,Vente,22000,5450,,LANN ER VENGLER,C126,56330,56031,Camors,56,,,56031000ZR0033,,,,,,,,,,,,,0,1,Maison,33,1,J,jardins,,,300,-3.012923,47.820644
2020-785818,2020-02-12,000001,Vente,1331,,,CORN ER HOET,C153,56330,56031,Camors,56,,,56031000ZK0122,,,,,,,,,,,,,0,,,,,J,jardins,,,674,-2.965983,47.840493
2020-785818,2020-02-12,000001,Vente,1331,,,CORN ER HOET,C153,56330,56031,Camors,56,,,56031000ZK0127,,,,,,,,,,,,,0,,,,,P,prés,,,657,-2.966256,47.840411
2020-785838,2020-02-28,000001,Vente,300000,5472,,LE GUIBEN,B184,56330,56031,Camors,56,,,56031000ZW0030,,,,,,,,,,,,,0,4,Local industriel. commercial ou assimilé,171,0,S,sols,,,1500,-3.00856,47.798058
2020-785838,2020-02-28,000001,Vente,300000,5472,,LE GUIBEN,B184,56330,56031,Camors,56,,,56031000ZW0030,,,,,,,,,,,,,0,1,Maison,70,4,P,prés,,,5100,-3.00856,47.798058
2020-785838,2020-02-28,000001,Vente,300000,5472,,LE GUIBEN,B184,56330,56031,Camors,56,,,56031000ZW0030,,,,,,,,,,,,,0,4,Local industriel. commercial ou assimilé,171,0,P,prés,,,5100,-3.00856,47.798058
2020-785838,2020-02-28,000001,Vente,300000,5472,,LE GUIBEN,B184,56330,56031,Camors,56,,,56031000ZW0030,,,,,,,,,,,,,0,1,Maison,70,4,S,sols,,,1500,-3.00856,47.798058
2020-785873,2020-02-17,000001,Vente,344500,5590,,LAMBEL,B215,56330,56031,Camors,56,,,56031000AB0056,,,,,,,,,,,,,0,1,Maison,197,8,P,prés,,,2000,-3.029521,47.838385
2020-785873,2020-02-17,000001,Vente,344500,5590,,LAMBEL,B215,56330,56031,Camors,56,,,56031000AB0056,,,,,,,,,,,,,0,1,Maison,197,8,S,sols,,,1438,-3.029521,47.838385
2020-785873,2020-02-17,000001,Vente,344500,5590,,LAMBEL,B215,56330,56031,Camors,56,,,56031000AB0056,,,,,,,,,,,,,0,1,Maison,197,8,AG,terrains d'agrément,,,2000,-3.029521,47.838385
2020-785963,2020-02-28,000001,Vente,118000,16,,RUE DES ACACIAS,0007,56330,56031,Camors,56,,,56031000ZD0033,,,,,,,,,,,,,0,1,Maison,80,4,J,jardins,,,600,-3.001134,47.849615
2020-785963,2020-02-28,000001,Vente,118000,16,,RUE DES ACACIAS,0007,56330,56031,Camors,56,,,56031000ZD0033,,,,,,,,,,,,,0,1,Maison,80,4,S,sols,,,106,-3.001134,47.849615
2020-786060,2020-03-13,000001,Vente,165000,4,,RUE DES MESANGES,0202,56330,56031,Camors,56,,,56031000AB0050,,,,,,,,,,,,,0,1,Maison,153,4,S,sols,,,981,-3.028344,47.838735
2020-786084,2020-03-03,000001,Vente,32500,,,PRAD LANN,C204,56330,56031,Camors,56,,,56031000ZN0681,,,,,,,,,,,,,0,,,,,T,terres,,,1211,-2.99712,47.84407
2020-786087,2020-03-10,000001,Vente,24,,,RUE DU PETIT BOIS,0211,56330,56031,Camors,56,,,56031000ZC0171,,,,,,,,,,,,,0,,,,,S,sols,,,24,-3.010354,47.845527
2020-786098,2020-03-10,000001,Vente,24,,,RUE DU PETIT BOIS,0211,56330,56031,Camors,56,,,56031000ZC0169,,,,,,,,,,,,,0,,,,,S,sols,,,24,-3.010383,47.845506
2020-786206,2020-03-18,000001,Vente,190000,5326,A,KERGORNIC,B201,56330,56031,Camors,56,,,56031000ZV0034,,,,,,,,,,,,,0,1,Maison,143,7,J,jardins,,,1233,-2.989973,47.814956
2020-786206,2020-03-18,000001,Vente,190000,5326,A,KERGORNIC,B201,56330,56031,Camors,56,,,56031000ZV0034,,,,,,,,,,,,,0,1,Maison,143,7,BR,futaies résineuses,,,9182,-2.989973,47.814956
2020-786206,2020-03-18,000001,Vente,190000,5326,A,KERGORNIC,B201,56330,56031,Camors,56,,,56031000ZV0034,,,,,,,,,,,,,0,1,Maison,143,7,S,sols,,,911,-2.989973,47.814956
2020-786206,2020-03-18,000001,Vente,190000,5326,A,KERGORNIC,B201,56330,56031,Camors,56,,,56031000ZV0034,,,,,,,,,,,,,0,1,Maison,143,7,AG,terrains d'agrément,,,854,-2.989973,47.814956
2020-786230,2020-04-15,000001,Vente,228500,10,,RUE FORESTIERE - LOCOAL,0079,56330,56031,Camors,56,,,56031000ZR0135,,,,,,,,,,,,,0,1,Maison,200,5,S,sols,,,440,-3.014815,47.824024
2020-786265,2020-04-24,000001,Vente,194000,6589,,LANGROIX,B218,56330,56031,Camors,56,,,56031000ZO0297,,,,,,,,,,,,,0,1,Maison,115,4,S,sols,,,1240,-3.002511,47.832482
2020-786379,2020-04-30,000001,Vente,97000,,,PENHER KREIS,B638,56330,56031,Camors,56,,,56031000ZO0122,,,,,,,,,,,,,0,1,Maison,88,4,S,sols,,,1000,,
2020-786379,2020-04-30,000001,Vente,97000,,,PENHER KREIS,B638,56330,56031,Camors,56,,,56031000ZO0239,,,,,,,,,,,,,0,,,,,S,sols,,,96,-3.000453,47.834175
2020-786379,2020-04-30,000001,Vente,97000,,,PENHER KREIS,B638,56330,56031,Camors,56,,,56031000ZO0444,,,,,,,,,,,,,0,,,,,T,terres,,,884,,
2020-786394,2020-05-14,000002,Vente,150000,5,,IMP DES MENHIRS,0195,56330,56031,Camors,56,,,56031000ZO0036,,,,,,,,,,,,,0,1,Maison,123,6,S,sols,,,180,-2.992819,47.835214
2020-786394,2020-05-14,000002,Vente,150000,5,,IMP DES MENHIRS,0195,56330,56031,Camors,56,,,56031000ZO0036,,,,,,,,,,,,,0,1,Maison,123,6,T,terres,,,6360,-2.992819,47.835214
2020-786394,2020-05-14,000002,Vente,150000,5,,IMP DES MENHIRS,0195,56330,56031,Camors,56,,,56031000ZO0036,,,,,,,,,,,,,0,1,Maison,123,6,T,terres,,,6360,-2.992819,47.835214
2020-786394,2020-05-14,000002,Vente,150000,5,,IMP DES MENHIRS,0195,56330,56031,Camors,56,,,56031000ZO0036,,,,,,,,,,,,,0,1,Maison,123,6,BR,futaies résineuses,,,4270,-2.992819,47.835214
2020-786394,2020-05-14,000002,Vente,150000,,,VGE COET ER GANQUIS,B015,56330,56031,Camors,56,,,56031000ZO0277,,,,,,,,,,,,,0,,,,,T,terres,,,720,-2.99239,47.835447
2020-786394,2020-05-14,000002,Vente,150000,,,VGE COET ER SACH,B017,56330,56031,Camors,56,,,56031000ZO0569,,,,,,,,,,,,,0,,,,,AB,terrains a bâtir,,,1302,-2.9928,47.835947
2020-786396,2020-05-14,000001,Vente,213000,4,,RUE DES LAVANDIERES,0131,56330,56031,Camors,56,,,56031000ZN0727,,,,,,,,,,,,,0,1,Maison,119,5,S,sols,,,611,-2.996727,47.841699
2020-786396,2020-05-14,000001,Vente,213000,4,,RUE DES LAVANDIERES,0131,56330,56031,Camors,56,,,56031000ZN0731,,,,,,,,,,,,,0,,,,,J,jardins,,,876,-2.996464,47.841727
2020-786398,2020-05-15,000001,Vente,210000,38,,RUE LANN MAREU,0127,56330,56031,Camors,56,,,56031000ZD0308,,,,,,,,,,,,,0,1,Maison,96,4,AG,terrains d'agrément,,,915,-2.993479,47.852624
2020-786398,2020-05-15,000001,Vente,210000,38,,RUE LANN MAREU,0127,56330,56031,Camors,56,,,56031000ZD0308,,,,,,,,,,,,,0,1,Maison,96,4,S,sols,,,385,-2.993479,47.852624
2020-786446,2020-05-13,000001,Vente,39800,,,COET KERLAN,B868,56330,56031,Camors,56,,,56031000ZP0083,,,,,,,,,,,,,0,,,,,T,terres,,,2420,-3.010772,47.826795
2020-786450,2020-05-20,000001,Vente,273000,5,,RUE DES TILLEULS,0236,56330,56031,Camors,56,,,56031000ZO0480,,,,,,,,,,,,,0,1,Maison,210,5,T,terres,,,3046,-2.99674,47.833003
2020-786450,2020-05-20,000001,Vente,273000,5,,RUE DES TILLEULS,0236,56330,56031,Camors,56,,,56031000ZO0480,,,,,,,,,,,,,0,1,Maison,210,5,S,sols,,,1000,-2.99674,47.833003
2020-786524,2020-05-19,000001,Vente,150000,,,PARC CAMORS,B441,56330,56031,Camors,56,,,56031000ZX0027,,,,,,,,,,,,,0,,,,,P,prés,,,100,-3.01419,47.806376
2020-786524,2020-05-19,000001,Vente,150000,5466,,KERDONIO,C124,56330,56031,Camors,56,,,56031000ZX0033,,,,,,,,,,,,,0,1,Maison,75,4,S,sols,,,2150,-3.016085,47.80562
2020-786524,2020-05-19,000001,Vente,150000,,,PRAD FETAN,B670,56330,56031,Camors,56,,,56031000ZX0087,,,,,,,,,,,,,0,,,,,P,prés,,,857,-3.016478,47.80554
2020-786529,2020-05-19,000001,Vente,100000,,,LE BOURG,B008,56330,56031,Camors,56,,,56031000ZC0026,,,,,,,,,,,,,0,,,,,AB,terrains a bâtir,,,610,-3.002771,47.847601
2020-786529,2020-05-19,000001,Vente,100000,11,,RUE DE L ETANG,0068,56330,56031,Camors,56,,,56031000ZC0027,,,,,,,,,,,,,0,1,Maison,45,3,S,sols,,,500,-3.00264,47.847631
2020-786550,2020-06-03,000002,Echange,650,,,IMP DE PENHER BOUEDEC,0103,56330,56031,Camors,56,,,56031000ZN0747,,,,,,,,,,,,,0,,,,,S,sols,,,13,-2.991189,47.838856
2020-786564,2020-05-28,000001,Vente,170000,5483,,LA PETITE METAIRIE,C099,56330,56031,Camors,56,,,56031000YA0051,,,,,,,,,,,,,0,1,Maison,80,3,S,sols,,,912,-3.019576,47.81018
2020-786565,2020-05-28,000001,Vente,125000,,,LANN ER VILINE,C091,56330,56031,Camors,56,,,56031000YC0052,,,,,,,,,,,,,0,,,,,AB,terrains a bâtir,CHEM,Chemin (non groupe),1100,-3.039166,47.809613
2020-786565,2020-05-28,000001,Vente,125000,,,LANN ER VILINE,C091,56330,56031,Camors,56,,,56031000YC0052,,,,,,,,,,,,,0,,,,,L,landes,,,10680,-3.039166,47.809613
2020-786565,2020-05-28,000001,Vente,125000,75,B,MOULIN DE CHAQUEL,C046,56330,56031,Camors,56,,,56031000YC0075,,,,,,,,,,,,,0,1,Maison,78,3,L,landes,,,1380,-3.03996,47.808517
2020-786565,2020-05-28,000001,Vente,125000,75,B,MOULIN DE CHAQUEL,C046,56330,56031,Camors,56,,,56031000YC0075,,,,,,,,,,,,,0,1,Maison,78,3,S,sols,,,100,-3.03996,47.808517
2020-786565,2020-05-28,000001,Vente,125000,75,B,MOULIN DE CHAQUEL,C046,56330,56031,Camors,56,,,56031000YC0075,,,,,,,,,,,,,0,1,Maison,78,3,P,prés,,,1461,-3.03996,47.808517
2020-786579,2020-05-29,000001,Vente,80850,3,,RUE DE FLORANGES,0076,56330,56031,Camors,56,,,56031000ZN0706,,,,,,,,,,,,,0,1,Maison,44,3,S,sols,,,99,-2.999046,47.846031
2020-786615,2020-06-02,000001,Vente,186300,5268,,RUE DE LA FORET,0080,56330,56031,Camors,56,,,56031000ZN0708,,,,,,,,,,,,,0,1,Maison,125,5,S,sols,,,962,-2.999981,47.837874
2020-786627,2020-06-13,000001,Vente,148000,4,,RUE DES CYPRES,0053,56330,56031,Camors,56,,,56031000ZC0086,,,,,,,,,,,,,0,1,Maison,104,5,S,sols,,,828,-3.002415,47.846715
2020-786725,2020-06-22,000001,Vente,32340,,,RUE DES LILAS,0201,56330,56031,Camors,56,,,56031000ZC0294,,,,,,,,,,,,,0,,,,,AB,terrains a bâtir,,,503,-3.002433,47.847663
2020-786728,2020-06-03,000001,Vente,35995.94,,,LANN KERMARREC,C135,56330,56031,Camors,56,,,56031000ZB0064,,,,,,,,,,,,,0,,,,,S,sols,,,18,-3.002893,47.851497
2020-786728,2020-06-03,000001,Vente,35995.94,,,LANN KERMARREC,C135,56330,56031,Camors,56,,,56031000ZB0064,,,,,,,,,,,,,0,,,,,J,jardins,,,953,-3.002893,47.851497
2020-786807,2020-06-26,000001,Vente,36900,,,RES LES JARDINS DE MARYLISE,A007,56330,56031,Camors,56,,,56031000ZD0406,,,,,,,,,,,,,0,,,,,AB,terrains a bâtir,,,424,-2.997777,47.847826
2020-786807,2020-06-26,000001,Vente,36900,,,RES LES JARDINS DE MARYLISE,A007,56330,56031,Camors,56,,,56031000ZD0407,,,,,,,,,,,,,0,,,,,AB,terrains a bâtir,,,54,-2.997802,47.847717
2020-786808,2020-06-24,000001,Vente,225000,57,,RUE DE SPERNEN,0108,56330,56031,Camors,56,,,56031000ZP0172,,,,,,,,,,,,,0,1,Maison,122,4,S,sols,,,1010,-3.002718,47.821945
2020-786814,2020-06-30,000001,Vente,207000,24,,RUE DU VIEUX PRESBYTERE,0212,56330,56031,Camors,56,,,56031000ZD0321,,,,,,,,,,,,,0,1,Maison,91,4,S,sols,,,792,-2.996392,47.849332
2020-786850,2020-06-26,000001,Vente,200000,71,,RUE DE SPERNEN,0108,56330,56031,Camors,56,,,56031000ZS0074,,,,,,,,,,,,,0,1,Maison,137,4,S,sols,,,1000,-3.002856,47.819294
2020-786850,2020-06-26,000001,Vente,200000,71,,RUE DE SPERNEN,0108,56330,56031,Camors,56,,,56031000ZS0074,,,,,,,,,,,,,0,1,Maison,137,4,AG,terrains d'agrément,,,2779,-3.002856,47.819294
2020-786910,2020-07-21,000001,Vente,280000,5855,,LE GRAND COSQUER,B165,56330,56031,Camors,56,,,56031000ZN0732,,,,,,,,,,,,,0,1,Maison,94,4,P,prés,,,9268,-2.985915,47.837248
2020-786910,2020-07-21,000001,Vente,280000,5855,,LE GRAND COSQUER,B165,56330,56031,Camors,56,,,56031000ZN0732,,,,,,,,,,,,,0,1,Maison,94,4,P,prés,,,5861,-2.985915,47.837248
2020-786910,2020-07-21,000001,Vente,280000,5855,,LE GRAND COSQUER,B165,56330,56031,Camors,56,,,56031000ZN0732,,,,,,,,,,,,,0,1,Maison,107,5,P,prés,,,5861,-2.985915,47.837248
2020-786910,2020-07-21,000001,Vente,280000,5855,,LE GRAND COSQUER,B165,56330,56031,Camors,56,,,56031000ZN0732,,,,,,,,,,,,,0,1,Maison,94,4,T,terres,,,20387,-2.985915,47.837248
2020-786910,2020-07-21,000001,Vente,280000,5855,,LE GRAND COSQUER,B165,56330,56031,Camors,56,,,56031000ZN0732,,,,,,,,,,,,,0,1,Maison,107,5,T,terres,,,20387,-2.985915,47.837248
2020-786910,2020-07-21,000001,Vente,280000,5855,,LE GRAND COSQUER,B165,56330,56031,Camors,56,,,56031000ZN0732,,,,,,,,,,,,,0,1,Maison,107,5,P,prés,,,9268,-2.985915,47.837248
2020-786910,2020-07-21,000001,Vente,280000,5855,,LE GRAND COSQUER,B165,56330,56031,Camors,56,,,56031000ZN0732,,,,,,,,,,,,,0,1,Maison,94,4,S,sols,,,1437,-2.985915,47.837248
2020-786910,2020-07-21,000001,Vente,280000,5855,,LE GRAND COSQUER,B165,56330,56031,Camors,56,,,56031000ZN0732,,,,,,,,,,,,,0,1,Maison,107,5,S,sols,,,1437,-2.985915,47.837248
2020-786937,2020-07-15,000001,Vente,280510,21,,RUE LANN MAREU,0127,56330,56031,Camors,56,,,56031000ZD0154,,,,,,,,,,,,,0,1,Maison,151,5,S,sols,,,1200,-2.996259,47.852849
2020-786937,2020-07-15,000001,Vente,280510,21,,RUE LANN MAREU,0127,56330,56031,Camors,56,,,56031000ZD0154,,,,,,,,,,,,,0,1,Maison,151,5,AG,terrains d'agrément,,,2440,-2.996259,47.852849
2020-786961,2020-07-21,000001,Vente,75000,11,,IMP DE LANN GANNEC,0133,56330,56031,Camors,56,,,56031000ZA0099,,,,,,,,,,,,,0,1,Maison,76,3,S,sols,,,631,-3.011076,47.86044
2020-786974,2020-07-17,000001,Vente,20000,6087,,LAMBEL,B215,56330,56031,Camors,56,,,56031000AB0015,,,,,,,,,,,,,0,3,Dépendance,,0,J,jardins,,,583,-3.033866,47.836687
2020-787052,2020-07-31,000001,Vente,4800,,,LANN PENVERN,C209,56330,56031,Camors,56,,,56031000ZW0003,,,,,,,,,,,,,0,,,,,T,terres,,,10250,-3.008935,47.806309
2020-787061,2020-07-31,000002,Vente,42500,,,IMP DES HIRONDELLES,0100,56330,56031,Camors,56,,,56031000AB0402,,,,,,,,,,,,,0,,,,,J,jardins,,,674,-3.031359,47.837046
2020-787061,2020-07-31,000002,Vente,42500,,,IMP DES HIRONDELLES,0100,56330,56031,Camors,56,,,56031000AB0403,,,,,,,,,,,,,0,,,,,J,jardins,,,3861,-3.031055,47.836672
2020-787062,2020-07-30,000001,Vente,260000,41,,RUE DU PETIT BOIS,0211,56330,56031,Camors,56,,,56031000ZC0123,,,,,,,,,,,,,0,1,Maison,138,4,S,sols,,,450,-3.009069,47.845388
2020-787062,2020-07-30,000001,Vente,260000,41,,RUE DU PETIT BOIS,0211,56330,56031,Camors,56,,,56031000ZC0123,,,,,,,,,,,,,0,1,Maison,138,4,J,jardins,,,990,-3.009069,47.845388
2020-787104,2020-07-01,000001,Vente,60000,,,ER VERGER,B131,56330,56031,Camors,56,,,56031000ZD0396,,,,,,,,,,,,,0,,,,,T,terres,,,1709,-2.994848,47.846989
2020-787117,2020-08-06,000001,Vente,262000,4,,IMP DES LAURIERS,0132,56330,56031,Camors,56,,,56031000ZO0262,,,,,,,,,,,,,0,1,Maison,165,7,S,sols,,,1738,,
2020-787117,2020-08-06,000001,Vente,262000,4,,IMP DES LAURIERS,0132,56330,56031,Camors,56,,,56031000ZO0262,,,,,,,,,,,,,0,1,Maison,165,7,AG,terrains d'agrément,,,3802,,
2020-787117,2020-08-06,000001,Vente,262000,4,,IMP DES LAURIERS,0132,56330,56031,Camors,56,,,56031000ZO0262,,,,,,,,,,,,,0,1,Maison,165,7,BS,taillis sous futaie,,,4200,,
2020-787117,2020-08-06,000001,Vente,262000,,,VGE COET ER SACH,B017,56330,56031,Camors,56,,,56031000ZO0263,,,,,,,,,,,,,0,,,,,AB,terrains a bâtir,CHEM,Chemin (non groupe),280,-2.995266,47.833817
2020-787191,2020-08-20,000001,Vente,231000,10,C,IMP DE LANN GANNEC,0133,56330,56031,Camors,56,,,56031000ZA0142,,,,,,,,,,,,,0,1,Maison,113,5,S,sols,,,905,-3.012063,47.860473
2020-787223,2020-08-19,000001,Vente,534000,,,LANN CHISTRO,B226,56330,56031,Camors,56,,,56031000ZB0006,,,,,,,,,,,,,0,,,,,BR,futaies résineuses,,,9950,-3.01794,47.854392
2020-787223,2020-08-19,000001,Vente,534000,,,LANN CHISTRO,B226,56330,56031,Camors,56,,,56031000ZB0006,,,,,,,,,,,,,0,,,,,BF,futaies feuillues,,,3500,-3.01794,47.854392
2020-787223,2020-08-19,000001,Vente,534000,,,LANN CHISTRO,B226,56330,56031,Camors,56,,,56031000ZB0006,,,,,,,,,,,,,0,,,,,BF,futaies feuillues,,,7240,-3.01794,47.854392
2020-787223,2020-08-19,000001,Vente,534000,,,LANN CHISTRO,B226,56330,56031,Camors,56,,,56031000ZB0006,,,,,,,,,,,,,0,,,,,BP,peupleraies,,,6470,-3.01794,47.854392
2020-787223,2020-08-19,000001,Vente,534000,,,LANN CHISTRO,B226,56330,56031,Camors,56,,,56031000ZB0006,,,,,,,,,,,,,0,,,,,BF,futaies feuillues,,,2540,-3.01794,47.854392
2020-787223,2020-08-19,000001,Vente,534000,,,PARC ER VELIN,C134,56330,56031,Camors,56,,,56031000ZB0007,,,,,,,,,,,,,0,,,,,L,landes,,,1420,-3.017768,47.85184
2020-787223,2020-08-19,000001,Vente,534000,,,PARC ER VELIN,C134,56330,56031,Camors,56,,,56031000ZB0007,,,,,,,,,,,,,0,,,,,BP,peupleraies,,,1630,-3.017768,47.85184
2020-787223,2020-08-19,000001,Vente,534000,,,PARC ER VELIN,C134,56330,56031,Camors,56,,,56031000ZB0007,,,,,,,,,,,,,0,,,,,BR,futaies résineuses,,,20530,-3.017768,47.85184
2020-787223,2020-08-19,000001,Vente,534000,,,PARC ER VELIN,C134,56330,56031,Camors,56,,,56031000ZB0007,,,,,,,,,,,,,0,,,,,P,prés,,,10140,-3.017768,47.85184
2020-787223,2020-08-19,000001,Vente,534000,,,PARC ER VELIN,C134,56330,56031,Camors,56,,,56031000ZB0007,,,,,,,,,,,,,0,,,,,BS,taillis sous futaie,,,860,-3.017768,47.85184
2020-787223,2020-08-19,000001,Vente,534000,5017,,MOULIN DE LA MOTTE,B412,56330,56031,Camors,56,,,56031000ZB0010,,,,,,,,,,,,,0,1,Maison,120,4,T,terres,,,2080,-3.018071,47.849921
2020-787223,2020-08-19,000001,Vente,534000,5017,,MOULIN DE LA MOTTE,B412,56330,56031,Camors,56,,,56031000ZB0010,,,,,,,,,,,,,0,1,Maison,120,4,S,sols,,,2990,-3.018071,47.849921
2020-787223,2020-08-19,000001,Vente,534000,5017,,MOULIN DE LA MOTTE,B412,56330,56031,Camors,56,,,56031000ZB0010,,,,,,,,,,,,,0,1,Maison,120,4,L,landes,,,7710,-3.018071,47.849921
2020-787223,2020-08-19,000001,Vente,534000,5017,,MOULIN DE LA MOTTE,B412,56330,56031,Camors,56,,,56031000ZB0010,,,,,,,,,,,,,0,1,Maison,120,4,E,eaux,,,10690,-3.018071,47.849921
2020-787223,2020-08-19,000001,Vente,534000,5017,,MOULIN DE LA MOTTE,B412,56330,56031,Camors,56,,,56031000ZB0010,,,,,,,,,,,,,0,1,Maison,120,4,P,prés,,,7770,-3.018071,47.849921
2020-787223,2020-08-19,000001,Vente,534000,,,PARC ER VELIN,C134,56330,56031,Camors,56,,,56031000ZB0011,,,,,,,,,,,,,0,,,,,BF,futaies feuillues,,,2940,-3.018281,47.84957
2020-787223,2020-08-19,000001,Vente,534000,,,PARC ER VELIN,C134,56330,56031,Camors,56,,,56031000ZB0105,,,,,,,,,,,,,0,,,,,T,terres,,,24130,-3.015271,47.851952
2020-787223,2020-08-19,000001,Vente,534000,,,PARC ER VELIN,C134,56330,56031,Camors,56,,,56031000ZB0105,,,,,,,,,,,,,0,,,,,T,terres,,,12065,-3.015271,47.851952
2020-787223,2020-08-19,000001,Vente,534000,,,PARC ER VELIN,C134,56330,56031,Camors,56,,,56031000ZB0105,,,,,,,,,,,,,0,,,,,BF,futaies feuillues,,,3670,-3.015271,47.851952
2020-787223,2020-08-19,000001,Vente,534000,,,PARC ER VELIN,C134,56330,56031,Camors,56,,,56031000ZB0105,,,,,,,,,,,,,0,,,,,T,terres,,,12065,-3.015271,47.851952
2020-787223,2020-08-19,000001,Vente,534000,,,PARC ER VELIN,C134,56330,56031,Camors,56,,,56031000ZB0106,,,,,,,,,,,,,0,,,,,T,terres,,,2210,-3.016286,47.848648
2020-787223,2020-08-19,000001,Vente,534000,,,PARC ER VELIN,C134,56330,56031,Camors,56,,,56031000ZB0106,,,,,,,,,,,,,0,,,,,BR,futaies résineuses,,,2090,-3.016286,47.848648
2020-787223,2020-08-19,000001,Vente,534000,,,PARC ER VELIN,C134,56330,56031,Camors,56,,,56031000ZB0106,,,,,,,,,,,,,0,,,,,L,landes,,,3930,-3.016286,47.848648
2020-787223,2020-08-19,000001,Vente,534000,,,PARC ER VELIN,C134,56330,56031,Camors,56,,,56031000ZB0106,,,,,,,,,,,,,0,,,,,T,terres,,,2220,-3.016286,47.848648
2020-787223,2020-08-19,000001,Vente,534000,,,PARC ER VELIN,C134,56330,56031,Camors,56,,,56031000ZB0106,,,,,,,,,,,,,0,,,,,P,prés,,,4450,-3.016286,47.848648
2020-787223,2020-08-19,000001,Vente,534000,,,PARC ER VELIN,C134,56330,56031,Camors,56,,,56031000ZB0106,,,,,,,,,,,,,0,,,,,L,landes,,,8750,-3.016286,47.848648
2020-787223,2020-08-19,000001,Vente,534000,,,PARC ER VELIN,C134,56330,56031,Camors,56,,,56031000ZB0106,,,,,,,,,,,,,0,,,,,T,terres,,,560,-3.016286,47.848648
2020-787223,2020-08-19,000001,Vente,534000,,,PARC ER VELIN,C134,56330,56031,Camors,56,,,56031000ZB0106,,,,,,,,,,,,,0,,,,,P,prés,,,560,-3.016286,47.848648
2020-787223,2020-08-19,000001,Vente,534000,,,PARC ER VELIN,C134,56330,56031,Camors,56,,,56031000ZB0106,,,,,,,,,,,,,0,,,,,L,landes,,,6550,-3.016286,47.848648
2020-787223,2020-08-19,000001,Vente,534000,,,PARC ER VELIN,C134,56330,56031,Camors,56,,,56031000ZB0112,,,,,,,,,,,,,0,,,,,AB,terrains a bâtir,CHEM,Chemin (non groupe),540,-3.015774,47.850525
2020-787306,2020-08-31,000001,Vente,117230,31,,RUE DU TONNELIER,0242,56330,56031,Camors,56,,,56031000ZN0319,,,,,,,,,,,,,0,1,Maison,74,5,S,sols,,,1059,-2.988391,47.835236
2020-787309,2020-09-08,000001,Vente,70000,19,,RUE DES MESANGES,0202,56330,56031,Camors,56,,,56031000AB0069,,,,,,,,,,,,,0,1,Maison,81,3,S,sols,,,258,-3.031664,47.836906
2020-787376,2020-09-04,000001,Vente,195000,5013,,LE GRAND CHISTRO,B164,56330,56031,Camors,56,,,56031000ZB0136,,,,,,,,,,,,,0,1,Maison,54,1,S,sols,,,2127,-3.011604,47.848287
2020-787376,2020-09-04,000001,Vente,195000,5013,,LE GRAND CHISTRO,B164,56330,56031,Camors,56,,,56031000ZB0136,,,,,,,,,,,,,0,1,Maison,88,4,S,sols,,,2127,-3.011604,47.848287
2020-787379,2020-09-08,000001,Vente,35200,,,RES LES JARDINS DE MARYLISE,A007,56330,56031,Camors,56,,,56031000ZD0409,,,,,,,,,,,,,0,,,,,AB,terrains a bâtir,,,470,-2.997352,47.847781
2020-787442,2020-09-17,000001,Vente,235000,3,,RUE DE L'ETOILE,0070,56330,56031,Camors,56,,,56031000AB0152,,,,,,,,,,,,,0,1,Maison,114,4,S,sols,,,1155,-3.026223,47.835749
2020-787514,2020-10-01,000001,Vente,351000,12,,RUE DES LAVANDIERES,0131,56330,56031,Camors,56,,,56031000ZN0394,,,,,,,,,,,,,0,1,Maison,143,4,S,sols,,,1000,-2.995268,47.841205
2020-787514,2020-10-01,000001,Vente,351000,12,,RUE DES LAVANDIERES,0131,56330,56031,Camors,56,,,56031000ZN0394,,,,,,,,,,,,,0,1,Maison,143,4,AG,terrains d'agrément,,,1853,-2.995268,47.841205
2020-787628,2020-10-12,000002,Vente,333750,5020,F,LANGROIX,B218,56330,56031,Camors,56,,,56031000ZP0249,,,,,,,,,,,,,0,1,Maison,161,5,,,,,,-3.003882,47.829717