id_mutation,date_mutation,numero_disposition,nature_mutation,valeur_fonciere,adresse_numero,adresse_suffixe,adresse_nom_voie,adresse_code_voie,code_postal,code_commune,nom_commune,code_departement,ancien_code_commune,ancien_nom_commune,id_parcelle,ancien_id_parcelle,numero_volume,lot1_numero,lot1_surface_carrez,lot2_numero,lot2_surface_carrez,lot3_numero,lot3_surface_carrez,lot4_numero,lot4_surface_carrez,lot5_numero,lot5_surface_carrez,nombre_lots,code_type_local,type_local,surface_reelle_bati,nombre_pieces_principales,code_nature_culture,nature_culture,code_nature_culture_speciale,nature_culture_speciale,surface_terrain,longitude,latitude
2020-788788,2020-01-14,000001,Vente,150000,,,LE CELLIER,B053,56430,56127,Mauron,56,,,56127000ZT0359,,,,,,,,,,,,,0,,,,,P,prés,,,1029,-2.28135,48.075309
2020-788788,2020-01-14,000001,Vente,150000,1,,LE CELLIER,B053,56430,56127,Mauron,56,,,56127000ZT0362,,,,,,,,,,,,,0,3,Dépendance,,0,S,sols,,,1255,-2.281799,48.075271
2020-788788,2020-01-14,000001,Vente,150000,1,,LE CELLIER,B053,56430,56127,Mauron,56,,,56127000ZT0362,,,,,,,,,,,,,0,1,Maison,110,4,S,sols,,,1255,-2.281799,48.075271
2020-788788,2020-01-14,000001,Vente,150000,,,LE CELLIER,B053,56430,56127,Mauron,56,,,56127000ZT0365,,,,,,,,,,,,,0,,,,,J,jardins,,,88,-2.282046,48.075075
2020-788792,2020-01-08,000001,Vente,223000,5,,RUE DES ROSEAUX,0757,56430,56127,Mauron,56,,,56127000XD0488,,,,,,,,,,,,,0,1,Maison,141,5,AB,terrains a bâtir,,,717,-2.297217,48.085281
2020-788847,2020-01-29,000001,Vente,23000,42,,RUE D ARMOR,0060,56430,56127,Mauron,56,,,56127000ZN0037,,,,,,,,,,,,,0,,,,,T,terres,,,1415,-2.295601,48.088749
2020-788847,2020-01-29,000001,Vente,23000,42,,RUE D ARMOR,0060,56430,56127,Mauron,56,,,56127000ZN0037,,,,,,,,,,,,,0,,,,,T,terres,,,1415,-2.295601,48.088749
2020-788848,2020-01-06,000002,Vente,5,,,LE PONT DE ROCHE,B276,56430,56127,Mauron,56,,,56127000ZR0179,,,,,,,,,,,,,0,,,,,S,sols,,,2,-2.270826,48.082283
2020-788849,2020-01-06,000003,Vente,38495,,,LE PONT DE ROCHE,B276,56430,56127,Mauron,56,,,56127000ZR0168,,,,,,,,,,,,,0,,,,,S,sols,,,100,-2.270769,48.082357
2020-788849,2020-01-06,000003,Vente,38495,5,,LA GREE AGA,B168,56430,56127,Mauron,56,,,56127000ZR0176,,,,,,,,,,,,,0,1,Maison,75,4,S,sols,,,289,-2.270827,48.082307
2020-788867,2020-01-16,000001,Vente,52873,,,LE BOURG,B407,56430,56127,Mauron,56,,,56127000AC0091,,,,,,,,,,,,,0,,,,,J,jardins,,,396,-2.282999,48.080898
2020-788867,2020-01-16,000001,Vente,52873,,,LE BOURG,B407,56430,56127,Mauron,56,,,56127000AC0321,,,,,,,,,,,,,0,,,,,T,terres,,,20,-2.283124,48.080858
2020-788867,2020-01-16,000001,Vente,52873,,,LE BOURG,B407,56430,56127,Mauron,56,,,56127000AC0322,,,,,,,,,,,,,0,,,,,T,terres,,,591,-2.282813,48.080924
2020-788867,2020-01-16,000001,Vente,52873,,,LE BOURG,B407,56430,56127,Mauron,56,,,56127000AC0341,,,,,,,,,,,,,0,,,,,T,terres,,,149,-2.283061,48.080786
2020-788867,2020-01-16,000001,Vente,52873,,,LE BOURG,B407,56430,56127,Mauron,56,,,56127000AC0343,,,,,,,,,,,,,0,,,,,J,jardins,,,23,-2.283127,48.080789
2020-788867,2020-01-16,000001,Vente,52873,,,RUE DES DEPORTES,0200,56430,56127,Mauron,56,,,56127000AC0410,,,,,,,,,,,,,0,,,,,T,terres,,,250,-2.283175,48.08073
2020-788893,2020-01-22,000001,Vente,55000,32,,LE BOUEE,B036,56430,56127,Mauron,56,,,56127000XC0066,,,,,,,,,,,,,0,1,Maison,58,3,S,sols,,,690,-2.304745,48.076616
2020-788893,2020-01-22,000001,Vente,55000,32,,LE BOUEE,B036,56430,56127,Mauron,56,,,56127000XC0066,,,,,,,,,,,,,0,1,Maison,58,3,T,terres,,,2110,-2.304745,48.076616
2020-788896,2020-01-24,000001,Vente,12000,,,LA GREE,B167,56430,56127,Mauron,56,,,56127000YB0099,,,,,,,,,,,,,0,,,,,P,prés,,,1090,-2.277857,48.047963
2020-788896,2020-01-24,000001,Vente,12000,7,,LA GREE,B167,56430,56127,Mauron,56,,,56127000YB0319,,,,,,,,,,,,,0,1,Maison,75,3,S,sols,,,360,-2.277723,48.047445
2020-788896,2020-01-24,000001,Vente,12000,,,LA GREE,B167,56430,56127,Mauron,56,,,56127000YB0321,,,,,,,,,,,,,0,,,,,S,sols,,,36,-2.277693,48.047463
2020-788896,2020-01-24,000001,Vente,12000,,,LA GREE,B167,56430,56127,Mauron,56,,,56127000YB0322,,,,,,,,,,,,,0,,,,,S,sols,,,150,-2.277807,48.047654
2020-788941,2020-02-07,000001,Vente,179000,5,,IMP DE LA SENECHAUSSEE,0559,56430,56127,Mauron,56,,,56127000YP0244,,,,,,,,,,,,,0,1,Maison,95,3,S,sols,,,720,-2.331257,48.044699
2020-788944,2020-02-10,000001,Vente,23000,4,,RUE ABBE ROBERT,0562,56430,56127,Mauron,56,,,56127000YP0252,,,,,,,,,,,,,0,1,Maison,45,3,S,sols,,,239,-2.331922,48.044398
2020-788985,2020-01-31,000001,Vente,40500,40,,RUE RENE CASSIN,0751,56430,56127,Mauron,56,,,56127000ZP0342,,,,,,,,,,,,,0,1,Maison,56,2,S,sols,,,231,-2.274706,48.085359
2020-789022,2020-02-14,000001,Vente,43835,,,LES GRANDS CLOS DE LA BODI,B162,56430,56127,Mauron,56,,,56127000ZB0009,,,,,,,,,,,,,0,,,,,T,terres,,,9410,-2.306597,48.13628
2020-789022,2020-02-14,000001,Vente,43835,,,LES GRANDS CLOS DE LA BODI,B162,56430,56127,Mauron,56,,,56127000ZB0014,,,,,,,,,,,,,0,,,,,T,terres,,,8300,-2.309565,48.131103
2020-789022,2020-02-14,000001,Vente,43835,,,LE DESSUS DE LA HAIE DE GA,B105,56430,56127,Mauron,56,,,56127000ZH0001,,,,,,,,,,,,,0,,,,,T,terres,,,11440,-2.281159,48.117319
2020-789022,2020-02-14,000001,Vente,43835,,,LE DESSUS DE LA HAIE DE GA,B105,56430,56127,Mauron,56,,,56127000ZH0008,,,,,,,,,,,,,0,,,,,P,prés,,,8680,-2.280491,48.119927
2020-789022,2020-02-14,000001,Vente,43835,,,LE CLOS DE LA SENTE,B080,56430,56127,Mauron,56,,,56127000ZL0071,,,,,,,,,,,,,0,,,,,T,terres,,,19880,-2.28533,48.117593
2020-789022,2020-02-14,000001,Vente,43835,,,LE CLOS DE LA SENTE,B080,56430,56127,Mauron,56,,,56127000ZL0072,,,,,,,,,,,,,0,,,,,T,terres,,,7660,-2.284567,48.118088
2020-789022,2020-02-14,000001,Vente,43835,,,LE CLOS DE LA SENTE,B080,56430,56127,Mauron,56,,,56127000ZL0072,,,,,,,,,,,,,0,,,,,T,terres,,,7660,-2.284567,48.118088
2020-789022,2020-02-14,000001,Vente,43835,,,LE CLOS DE LA SENTE,B080,56430,56127,Mauron,56,,,56127000ZL0132,,,,,,,,,,,,,0,,,,,T,terres,,,3873,-2.285928,48.117334
2020-789023,2020-02-07,000001,Vente,26500,25,,RUE DU PLESSIX,0680,56430,56127,Mauron,56,,,56127000AC0166,,,,,,,,,,,,,0,1,Maison,30,1,S,sols,,,90,-2.286822,48.080156
2020-789023,2020-02-07,000001,Vente,26500,25,,RUE DU PLESSIX,0680,56430,56127,Mauron,56,,,56127000AC0166,,,,,,,,,,,,,0,1,Maison,30,1,J,jardins,,,411,-2.286822,48.080156
2020-789027,2020-02-13,000001,Vente,75800,,,LE COUDRAY BAILLET,B098,56430,56127,Mauron,56,,,56127000YS0314,,,,,,,,,,,,,0,,,,,T,terres,,,64,-2.342865,48.061934
2020-789027,2020-02-13,000001,Vente,75800,34,,LE COUDRAY BAILLET,B098,56430,56127,Mauron,56,,,56127000YS0315,,,,,,,,,,,,,0,1,Maison,148,5,S,sols,,,443,-2.343014,48.061876
2020-789027,2020-02-13,000001,Vente,75800,,,LE COUDRAY BAILLET,B098,56430,56127,Mauron,56,,,56127000YS0325,,,,,,,,,,,,,0,,,,,J,jardins,,,415,-2.343113,48.062092
2020-789027,2020-02-13,000001,Vente,75800,,,LE COUDRAY BAILLET,B098,56430,56127,Mauron,56,,,56127000YS0387,,,,,,,,,,,,,0,,,,,J,jardins,,,274,-2.343183,48.061897
2020-789029,2020-02-14,000001,Vente,80000,,,LA BODINAIS,B026,56430,56127,Mauron,56,,,56127000ZD0051,,,,,,,,,,,,,0,,,,,S,sols,,,3650,-2.302421,48.132433
2020-789036,2020-02-05,000001,Vente,364600,,,LE PARC,B246,56430,56127,Mauron,56,,,56127000ZL0032,,,,,,,,,,,,,0,,,,,T,terres,,,26990,,
2020-789036,2020-02-05,000001,Vente,364600,,,LE PARC,B246,56430,56127,Mauron,56,,,56127000ZL0032,,,,,,,,,,,,,0,,,,,P,prés,,,25450,,
2020-789036,2020-02-05,000001,Vente,364600,,,LE PARC,B246,56430,56127,Mauron,56,,,56127000ZL0138,,,,,,,,,,,,,0,,,,,T,terres,,,1095,-2.280255,48.104517
2020-789036,2020-02-05,000001,Vente,364600,,,LE PARC,B246,56430,56127,Mauron,56,,,56127000ZL0138,,,,,,,,,,,,,0,,,,,T,terres,,,545,-2.280255,48.104517
2020-789036,2020-02-05,000001,Vente,364600,,,L ABBAYE,B001,56430,56127,Mauron,56,,,56127000ZO0115,,,,,,,,,,,,,0,,,,,P,prés,,,7620,-2.279698,48.104441
2020-789036,2020-02-05,000001,Vente,364600,,,L ABBAYE,B001,56430,56127,Mauron,56,,,56127000ZO0116,,,,,,,,,,,,,0,,,,,P,prés,,,2520,,
2020-789036,2020-02-05,000001,Vente,364600,12,,L ABBAYE PENGUILY,B377,56430,56127,Mauron,56,,,56127000ZO0154,,,,,,,,,,,,,0,1,Maison,199,6,S,sols,,,1998,-2.280115,48.104093
2020-789036,2020-02-05,000001,Vente,364600,,,L ABBAYE,B001,56430,56127,Mauron,56,,,56127000ZO0203,,,,,,,,,,,,,0,,,,,J,jardins,,,783,-2.280041,48.103736
2020-789036,2020-02-05,000001,Vente,364600,6921,,L ABBAYE,B001,56430,56127,Mauron,56,,,56127000ZO0210,,,,,,,,,,,,,0,1,Maison,35,1,S,sols,,,1278,-2.279843,48.103897
2020-789036,2020-02-05,000001,Vente,364600,6921,,L ABBAYE,B001,56430,56127,Mauron,56,,,56127000ZO0210,,,,,,,,,,,,,0,1,Maison,38,2,S,sols,,,1278,-2.279843,48.103897
2020-789036,2020-02-05,000001,Vente,364600,,,L ABBAYE,B001,56430,56127,Mauron,56,,,56127000ZO0212,,,,,,,,,,,,,0,,,,,J,jardins,,,85,-2.280296,48.103663
2020-789038,2020-02-14,000001,Vente,135000,4,,LA BODINAIS,B026,56430,56127,Mauron,56,,,56127000ZD0049,,,,,,,,,,,,,0,1,Maison,129,5,S,sols,,,4700,-2.303099,48.132623
2020-789038,2020-02-14,000001,Vente,135000,4,,LA BODINAIS,B026,56430,56127,Mauron,56,,,56127000ZD0049,,,,,,,,,,,,,0,1,Maison,20,1,S,sols,,,4700,-2.303099,48.132623
2020-789038,2020-02-14,000001,Vente,135000,,,LA BODINAIS,B026,56430,56127,Mauron,56,,,56127000ZD0050,,,,,,,,,,,,,0,,,,,J,jardins,,,660,-2.303357,48.132238
2020-789102,2020-02-20,000001,Vente,120000,9,,L ABBAYE PENGUILY,B377,56430,56127,Mauron,56,,,56127000ZO0207,,,,,,,,,,,,,0,1,Maison,108,6,S,sols,,,1239,-2.279175,48.103478
2020-789102,2020-02-20,000001,Vente,120000,,,L ABBAYE,B001,56430,56127,Mauron,56,,,56127000ZO0216,,,,,,,,,,,,,0,,,,,J,jardins,,,6,-2.279268,48.103732
2020-789168,2020-03-02,000001,Vente,8320,,,LES GRANDS DOMAINES,B163,56430,56127,Mauron,56,,,56127000YR0055,,,,,,,,,,,,,0,,,,,BP,peupleraies,,,950,-2.338078,48.04411
2020-789168,2020-03-02,000001,Vente,8320,,,LES GRANDS DOMAINES,B163,56430,56127,Mauron,56,,,56127000YR0055,,,,,,,,,,,,,0,,,,,B,bois,,,630,-2.338078,48.04411
2020-789172,2020-03-02,000001,Vente,6580,,,MONT PLAISIR,B226,56430,56127,Mauron,56,,,56127000YR0119,,,,,,,,,,,,,0,,,,,BR,futaies résineuses,,,4500,-2.343839,48.046489
2020-789172,2020-03-02,000001,Vente,6580,,,MONT PLAISIR,B226,56430,56127,Mauron,56,,,56127000YR0119,,,,,,,,,,,,,0,,,,,BT,taillis simples,,,5110,-2.343839,48.046489
2020-789174,2020-02-19,000001,Vente,2573,,,LES PRES DE BEUVE,B290,56430,56127,Mauron,56,,,56127000YB0038,,,,,,,,,,,,,0,,,,,S,sols,,,6320,-2.279283,48.050559
2020-789174,2020-02-19,000001,Vente,2573,,,LES PRES DE BEUVE,B290,56430,56127,Mauron,56,,,56127000YB0038,,,,,,,,,,,,,0,,,,,T,terres,,,15930,-2.279283,48.050559
2020-789174,2020-02-19,000001,Vente,2573,,,LES PRES DE BEUVE,B290,56430,56127,Mauron,56,,,56127000YB0039,,,,,,,,,,,,,0,,,,,S,sols,,,835,-2.2802,48.051185
2020-789174,2020-02-19,000001,Vente,2573,,,LES PRES DE BEUVE,B290,56430,56127,Mauron,56,,,56127000YB0039,,,,,,,,,,,,,0,,,,,T,terres,,,4655,-2.2802,48.051185
2020-789175,2020-02-19,000002,Vente,10000,,,LES PRES DE BEUVE,B290,56430,56127,Mauron,56,,,56127000YB0038,,,,,,,,,,,,,0,,,,,T,terres,,,15930,-2.279283,48.050559
2020-789175,2020-02-19,000002,Vente,10000,,,LES PRES DE BEUVE,B290,56430,56127,Mauron,56,,,56127000YB0038,,,,,,,,,,,,,0,,,,,S,sols,,,6320,-2.279283,48.050559
2020-789175,2020-02-19,000002,Vente,10000,,,LES PRES DE BEUVE,B290,56430,56127,Mauron,56,,,56127000YB0039,,,,,,,,,,,,,0,,,,,T,terres,,,4655,-2.2802,48.051185
2020-789175,2020-02-19,000002,Vente,10000,,,LES PRES DE BEUVE,B290,56430,56127,Mauron,56,,,56127000YB0039,,,,,,,,,,,,,0,,,,,S,sols,,,835,-2.2802,48.051185
2020-789230,2020-03-13,000001,Vente,1300,,,LES CLOSIAUX,B092,56430,56127,Mauron,56,,,56127000XB0045,,,,,,,,,,,,,0,,,,,T,terres,,,720,-2.321346,48.082722
2020-789230,2020-03-13,000001,Vente,1300,,,LES CLOSIAUX,B092,56430,56127,Mauron,56,,,56127000XB0172,,,,,,,,,,,,,0,,,,,L,landes,,,55,-2.321454,48.082599
2020-789260,2020-04-03,000001,Vente,60000,2,,RUE DE LA POINTE,0700,56430,56127,Mauron,56,,,56127000AB0550,,,,,,,,,,,,,0,1,Maison,50,2,S,sols,,,292,-2.289291,48.083811
2020-789288,2020-04-16,000001,Vente,12500,,,LE HUYER,B188,56430,56127,Mauron,56,,,56127000XA0187,,,,,,,,,,,,,0,,,,,S,sols,,,555,-2.348684,48.076041
2020-789297,2020-04-21,000001,Vente,90000,4,,RUE PASTEUR,0602,56430,56127,Mauron,56,,,56127000AD0079,,,,,,,,,,,,,0,1,Maison,80,5,S,sols,,,681,-2.278224,48.081875
2020-789344,2020-05-11,000001,Vente,35000,,,LEDREMEUC,B210,56430,56127,Mauron,56,,,56127000YI0113,,,,,,,,,,,,,0,,,,,P,prés,,,8155,-2.296583,48.060099
2020-789344,2020-05-11,000001,Vente,35000,,,LEDREMEUC,B210,56430,56127,Mauron,56,,,56127000YI0202,,,,,,,,,,,,,0,,,,,J,jardins,,,145,-2.295959,48.060484
2020-789344,2020-05-11,000001,Vente,35000,,,LEDREMEUC,B210,56430,56127,Mauron,56,,,56127000YI0203,,,,,,,,,,,,,0,,,,,J,jardins,,,189,-2.295743,48.060574
2020-789344,2020-05-11,000001,Vente,35000,,,LEDREMEUC,B210,56430,56127,Mauron,56,,,56127000YI0204,,,,,,,,,,,,,0,,,,,J,jardins,,,302,-2.295682,48.060463
2020-789344,2020-05-11,000001,Vente,35000,,,LEDREMEUC,B210,56430,56127,Mauron,56,,,56127000YI0205,,,,,,,,,,,,,0,,,,,J,jardins,,,303,-2.295951,48.060345
2020-789344,2020-05-11,000001,Vente,35000,,,LEDREMEUC,B210,56430,56127,Mauron,56,,,56127000YI0206,,,,,,,,,,,,,0,,,,,S,sols,,,639,-2.295685,48.060152
2020-789344,2020-05-11,000001,Vente,35000,6,,LEDREMEUC,B210,56430,56127,Mauron,56,,,56127000YI0207,,,,,,,,,,,,,0,1,Maison,33,1,S,sols,,,670,-2.29548,48.060203
2020-789363,2020-05-06,000001,Vente,195000,,,LE HUYER,B188,56430,56127,Mauron,56,,,56127000YW0103,,,,,,,,,,,,,0,,,,,T,terres,,,1950,-2.350277,48.076185
2020-789363,2020-05-06,000001,Vente,195000,12,,LE HUYER,B188,56430,56127,Mauron,56,,,56127000YW0104,,,,,,,,,,,,,0,1,Maison,50,3,S,sols,,,453,-2.349857,48.076003
2020-789363,2020-05-06,000001,Vente,195000,,,LE HUYER,B188,56430,56127,Mauron,56,,,56127000YW0105,,,,,,,,,,,,,0,,,,,L,landes,,,360,-2.350192,48.075967
2020-789363,2020-05-06,000001,Vente,195000,,,LE HUYER,B188,56430,56127,Mauron,56,,,56127000YW0106,,,,,,,,,,,,,0,,,,,S,sols,,,365,-2.350014,48.075869
2020-789364,2020-04-30,000001,Vente,118000,,,LEDREMEUC,B210,56430,56127,Mauron,56,,,56127000YI0051,,,,,,,,,,,,,0,,,,,J,jardins,,,1130,-2.294969,48.060185
2020-789364,2020-04-30,000001,Vente,118000,5,,LEDREMEUC,B210,56430,56127,Mauron,56,,,56127000YI0052,,,,,,,,,,,,,0,1,Maison,100,5,S,sols,,,554,-2.294627,48.060272
2020-789364,2020-04-30,000001,Vente,118000,,,LEDREMEUC,B210,56430,56127,Mauron,56,,,56127000YI0215,,,,,,,,,,,,,0,,,,,T,terres,,,2980,-2.294436,48.060427
2020-789364,2020-04-30,000001,Vente,118000,,,LEDREMEUC,B210,56430,56127,Mauron,56,,,56127000YI0217,,,,,,,,,,,,,0,,,,,T,terres,,,735,-2.294763,48.060509
2020-789391,2020-05-15,000001,Vente,72000,,,LE BOUEE,B036,56430,56127,Mauron,56,,,56127000YL0058,,,,,,,,,,,,,0,,,,,J,jardins,,,360,-2.303444,48.0763
2020-789391,2020-05-15,000001,Vente,72000,27,,LE BOUEE,B036,56430,56127,Mauron,56,,,56127000YL0132,,,,,,,,,,,,,0,1,Maison,62,2,S,sols,,,404,-2.30359,48.076432
2020-789391,2020-05-15,000001,Vente,72000,,,LE BOUEE,B036,56430,56127,Mauron,56,,,56127000YL0239,,,,,,,,,,,,,0,,,,,J,jardins,,,400,-2.303487,48.076258
2020-789409,2020-05-15,000001,Vente,23000,,,LE BOURG,B407,56430,56127,Mauron,56,,,56127000AC0503,,,,,,,,,,,,,0,,,,,P,prés,,,665,-2.283876,48.076789
2020-789538,2020-05-28,000001,Vente,700,,,LES HARDONNAIS,B178,56430,56127,Mauron,56,,,56127000YS0044,,,,,,,,,,,,,0,,,,,T,terres,,,630,-2.338684,48.059966
2020-789538,2020-05-28,000001,Vente,700,,,LES HARDONNAIS,B178,56430,56127,Mauron,56,,,56127000YS0044,,,,,,,,,,,,,0,,,,,T,terres,,,1260,-2.338684,48.059966
2020-789555,2020-05-29,000001,Vente,46125.46,,,LES GRASLINS,B165,56430,56127,Mauron,56,,,56127000YE0058,,,,,,,,,,,,,0,,,,,BP,peupleraies,,,20280,-2.316519,48.049546
2020-789555,2020-05-29,000001,Vente,46125.46,,,LES GRASLINS,B165,56430,56127,Mauron,56,,,56127000YE0058,,,,,,,,,,,,,0,,,,,BT,taillis simples,,,3280,-2.316519,48.049546
2020-789555,2020-05-29,000001,Vente,46125.46,,,LES GRASLINS,B165,56430,56127,Mauron,56,,,56127000YE0058,,,,,,,,,,,,,0,,,,,BR,futaies résineuses,,,2500,-2.316519,48.049546
2020-789555,2020-05-29,000001,Vente,46125.46,,,LE BIGNON,B025,56430,56127,Mauron,56,,,56127000YR0024,,,,,,,,,,,,,0,,,,,BR,futaies résineuses,,,1400,-2.339329,48.045434
2020-789555,2020-05-29,000001,Vente,46125.46,,,LE BIGNON,B025,56430,56127,Mauron,56,,,56127000YR0025,,,,,,,,,,,,,0,,,,,B,bois,,,6140,-2.339611,48.045317
2020-789555,2020-05-29,000001,Vente,46125.46,,,LE BIGNON,B025,56430,56127,Mauron,56,,,56127000YR0025,,,,,,,,,,,,,0,,,,,BR,futaies résineuses,,,14310,-2.339611,48.045317
2020-789565,2020-05-29,000001,Vente,79100,,,RUE PAUL MAULION,0640,56430,56127,Mauron,56,,,56127000AB0432,,,,,,,,,,,,,0,,,,,S,sols,,,9,-2.288359,48.08373
2020-789565,2020-05-29,000001,Vente,79100,48,,RUE PAUL MAULION,0640,56430,56127,Mauron,56,,,56127000AB0433,,,,,,,,,,,,,0,1,Maison,54,3,S,sols,,,89,-2.288296,48.083812
2020-789565,2020-05-29,000001,Vente,79100,,,RUE PAUL MAULION,0640,56430,56127,Mauron,56,,,56127000AB0436,,,,,,,,,,,,,0,,,,,S,sols,,,182,-2.288351,48.083941
2020-789565,2020-05-29,000001,Vente,79100,,,RUE PAUL MAULION,0640,56430,56127,Mauron,56,,,56127000AB0440,,,,,,,,,,,,,0,,,,,S,sols,,,24,-2.2885,48.084009
2020-789567,2020-06-06,000001,Vente,60000,20,,LE VALIDE,B347,56430,56127,Mauron,56,,,56127000ZA0128,,,,,,,,,,,,,0,1,Maison,141,4,S,sols,,,3284,-2.342668,48.118946
2020-789577,2020-06-02,000001,Vente,142000,,,RUE DES PEEZ,0660,56430,56127,Mauron,56,,,56127000AB0224,,,,,,,,,,,,,0,,,,,S,sols,,,466,-2.289029,48.082173
2020-789577,2020-06-02,000001,Vente,142000,,,LE BOURG,B407,56430,56127,Mauron,56,,,56127000AB0226,,,,,,,,,,,,,0,,,,,L,landes,,,117,-2.289111,48.082382
2020-789577,2020-06-02,000001,Vente,142000,14,,RUE DES PEEZ,0660,56430,56127,Mauron,56,,,56127000AB0227,,,,,,,,,,,,,0,1,Maison,109,5,S,sols,,,573,-2.289182,48.082231
2020-789659,2020-06-04,000001,Vente,90950,,,LE PONT RUELLAND,B277,56430,56127,Mauron,56,,,56127000XI0140,,,,,,,,,,,,,0,,,,,T,terres,,,4846,-2.31374,48.110492
2020-789659,2020-06-04,000001,Vente,90950,3,,LE PONT RUELLAND,B277,56430,56127,Mauron,56,,,56127000XI0141,,,,,,,,,,,,,0,1,Maison,107,4,S,sols,,,671,-2.314828,48.110223
2020-789700,2020-06-25,000001,Vente,37000,24,,RUE DU PLESSIX,0680,56430,56127,Mauron,56,,,56127000AC0024,,,,,,,,,,,,,0,1,Maison,106,4,S,sols,,,887,-2.287277,48.080702
2020-789701,2020-06-23,000001,Vente,23063,,,LE GRAND MOULIN,B157,56430,56127,Mauron,56,,,56127000YK0025,,,,,,,,,,,,,0,,,,,BP,peupleraies,,,714,-2.289667,48.074869
2020-789701,2020-06-23,000001,Vente,23063,,,LE GRAND MOULIN,B157,56430,56127,Mauron,56,,,56127000YK0025,,,,,,,,,,,,,0,,,,,BP,peupleraies,,,3862,-2.289667,48.074869
2020-789701,2020-06-23,000001,Vente,23063,,,LE GRAND MOULIN,B157,56430,56127,Mauron,56,,,56127000YK0025,,,,,,,,,,,,,0,,,,,BT,taillis simples,,,4604,-2.289667,48.074869
2020-789701,2020-06-23,000001,Vente,23063,,,LE GRAND MOULIN,B157,56430,56127,Mauron,56,,,56127000YK0025,,,,,,,,,,,,,0,,,,,B,bois,,,4040,-2.289667,48.074869
2020-789701,2020-06-23,000001,Vente,23063,,,SOUS LE DOUEFF,B325,56430,56127,Mauron,56,,,56127000YK0034,,,,,,,,,,,,,0,,,,,BP,peupleraies,,,6240,-2.290799,48.074012
2020-789701,2020-06-23,000001,Vente,23063,,,SOUS LE DOUEFF,B325,56430,56127,Mauron,56,,,56127000YK0034,,,,,,,,,,,,,0,,,,,BT,taillis simples,,,2295,-2.290799,48.074012
2020-789701,2020-06-23,000001,Vente,23063,,,SOUS LE DOUEFF,B325,56430,56127,Mauron,56,,,56127000YK0034,,,,,,,,,,,,,0,,,,,BR,futaies résineuses,,,4675,-2.290799,48.074012
2020-789701,2020-06-23,000001,Vente,23063,,,SOUS LE DOUEFF,B325,56430,56127,Mauron,56,,,56127000YK0034,,,,,,,,,,,,,0,,,,,BP,peupleraies,,,4690,-2.290799,48.074012
2020-789701,2020-06-23,000001,Vente,23063,,,LE GRAND MOULIN,B157,56430,56127,Mauron,56,,,56127000YK0055,,,,,,,,,,,,,0,,,,,BP,peupleraies,,,4630,-2.2913,48.074357
2020-789701,2020-06-23,000001,Vente,23063,,,LE GRAND MOULIN,B157,56430,56127,Mauron,56,,,56127000YK0056,,,,,,,,,,,,,0,,,,,BT,taillis simples,,,475,-2.291626,48.074692
2020-789701,2020-06-23,000001,Vente,23063,,,LE GRAND MOULIN,B157,56430,56127,Mauron,56,,,56127000YK0058,,,,,,,,,,,,,0,,,,,BT,taillis simples,,,2180,-2.290567,48.075166
2020-789715,2020-06-30,000001,Vente,200333,,,LA BANDE DES PORTES,B016,56430,56127,Mauron,56,,,56127000YE0088,,,,,,,,,,,,,0,,,,,T,terres,,,2880,-2.326803,48.04511
2020-789715,2020-06-30,000001,Vente,200333,2,,LES PORTES,B284,56430,56127,Mauron,56,,,56127000YP0119,,,,,,,,,,,,,0,1,Maison,65,2,S,sols,,,875,-2.32712,48.044713
2020-789715,2020-06-30,000001,Vente,200333,,,LES PORTES,B284,56430,56127,Mauron,56,,,56127000YP0120,,,,,,,,,,,,,0,,,,,J,jardins,,,1480,-2.327101,48.044909
2020-789759,2020-07-08,000001,Vente,117000,7,,RUE DE LA VILLE EN BOIS,0900,56430,56127,Mauron,56,,,56127000ZP0116,,,,,,,,,,,,,0,1,Maison,80,3,J,jardins,,,813,-2.278933,48.084019
2020-789759,2020-07-08,000001,Vente,117000,7,,RUE DE LA VILLE EN BOIS,0900,56430,56127,Mauron,56,,,56127000ZP0116,,,,,,,,,,,,,0,1,Maison,80,3,S,sols,,,680,-2.278933,48.084019
2020-789793,2020-07-01,000001,Vente,64440,13,,RUE PAUL MAULION,0640,56430,56127,Mauron,56,,,56127000AB0452,,,,,,,,,,,,,0,1,Maison,118,4,S,sols,,,120,-2.286332,48.083129
2020-789794,2020-06-19,000001,Vente,64000,1,,RUE DE LA SENECHAUSSEE,0557,56430,56127,Mauron,56,,,56127000YP0238,,,,,,,,,,,,,0,,,,,S,sols,,,2630,-2.330726,48.044865
2020-789841,2020-07-02,000001,Vente,2000,,,FERME DE BOIS JAIGU,B122,56430,56127,Mauron,56,,,56127000YB0297,,,,,,,,,,,,,0,,,,,P,prés,,,1273,-2.281786,48.057546
2020-789841,2020-07-02,000001,Vente,2000,,,FERME DE BOIS JAIGU,B122,56430,56127,Mauron,56,,,56127000YB0298,,,,,,,,,,,,,0,,,,,S,sols,,,3103,-2.28073,48.056602
2020-789843,2020-07-06,000001,Vente,2500,6585,,LA VILLE FEVRIER,B363,56430,56127,Mauron,56,,,56127000ZO0028,,,,,,,,,,,,,0,4,Local industriel. commercial ou assimilé,200,0,S,sols,,,1055,-2.275562,48.099409
2020-789882,2020-07-10,000001,Vente,3272.13,,,LE BOIS DE MEAUX,B029,56430,56127,Mauron,56,,,56127000ZL0145,,,,,,,,,,,,,0,,,,,T,terres,,,12119,-2.281648,48.116174
2020-789904,2020-07-07,000001,Vente,95000,13,,RUE DU PORHOET,0710,56430,56127,Mauron,56,,,56127000XD0176,,,,,,,,,,,,,0,1,Maison,67,3,J,jardins,,,2123,-2.296396,48.082799
2020-789904,2020-07-07,000001,Vente,95000,13,,RUE DU PORHOET,0710,56430,56127,Mauron,56,,,56127000XD0176,,,,,,,,,,,,,0,1,Maison,67,3,S,sols,,,500,-2.296396,48.082799
2020-789904,2020-07-07,000001,Vente,95000,,,LES PRES DES PEEZ,B291,56430,56127,Mauron,56,,,56127000XD0179,,,,,,,,,,,,,0,,,,,T,terres,,,1015,-2.296594,48.083269
2020-789989,2020-07-30,000001,Vente,190000,1,,RUE PAUL MAULION,0640,56430,56127,Mauron,56,,,56127000AB0155,,,,,,,,,,,,,0,1,Maison,90,4,S,sols,,,195,-2.284708,48.083179
2020-789989,2020-07-30,000001,Vente,190000,1,,RUE PAUL MAULION,0640,56430,56127,Mauron,56,,,56127000AB0155,,,,,,,,,,,,,0,4,Local industriel. commercial ou assimilé,65,0,S,sols,,,195,-2.284708,48.083179
2020-789989,2020-07-30,000001,Vente,190000,,,RUE NATIONALE,0580,56430,56127,Mauron,56,,,56127000AB0477,,,,,,,,,,,,,0,,,,,AB,terrains a bâtir,,,214,-2.284755,48.083062
2020-790031,2020-08-04,000001,Vente,7163.8,,,L EPINE BLANCHE,B115,56430,56127,Mauron,56,,,56127000YI0016,,,,,,,,,,,,,0,,,,,T,terres,,,16660,-2.29564,48.061449
2020-790037,2020-08-05,000001,Vente,46000,6265,,RUE DES PEEZ,0660,56430,56127,Mauron,56,,,56127000AC0012,,,,,,,,,,,,,0,3,Dépendance,,0,J,jardins,,,839,-2.28791,48.081623
2020-790037,2020-08-05,000001,Vente,46000,6265,,RUE DES PEEZ,0660,56430,56127,Mauron,56,,,56127000AC0012,,,,,,,,,,,,,0,3,Dépendance,,0,S,sols,,,49,-2.28791,48.081623
2020-790038,2020-08-05,000001,Vente,143555,4,,RUE DES PEEZ,0660,56430,56127,Mauron,56,,,56127000AB0218,,,,,,,,,,,,,0,1,Maison,140,5,S,sols,,,192,-2.287959,48.081899
2020-790043,2020-08-11,000001,Vente,30000,3,,AV JEAN ALLAIN,0470,56430,56127,Mauron,56,,,56127000AD0002,,,,,,,,,,,,,0,1,Maison,84,3,S,sols,,,172,-2.282262,48.083271
2020-790048,2020-08-11,000001,Vente,167500,5,,RUE DU PONT DE GUE,0704,56430,56127,Mauron,56,,,56127000ZP0267,,,,,,,,,,,,,0,1,Maison,96,6,S,sols,,,930,-2.278846,48.086405