id_mutation,date_mutation,numero_disposition,nature_mutation,valeur_fonciere,adresse_numero,adresse_suffixe,adresse_nom_voie,adresse_code_voie,code_postal,code_commune,nom_commune,code_departement,ancien_code_commune,ancien_nom_commune,id_parcelle,ancien_id_parcelle,numero_volume,lot1_numero,lot1_surface_carrez,lot2_numero,lot2_surface_carrez,lot3_numero,lot3_surface_carrez,lot4_numero,lot4_surface_carrez,lot5_numero,lot5_surface_carrez,nombre_lots,code_type_local,type_local,surface_reelle_bati,nombre_pieces_principales,code_nature_culture,nature_culture,code_nature_culture_speciale,nature_culture_speciale,surface_terrain,longitude,latitude
2020-780101,2020-09-11,000001,Vente,1800,,,LANDE DE SAINT MARC,C423,56490,56134,Mohon,56,,,56134000ZA0095,,,,,,,,,,,,,0,,,,,T,terres,,,2000,-2.526811,48.072581
2020-780101,2020-09-11,000001,Vente,1800,,,LA JEANNETTE DE SUR LE TER,C278,56490,56134,Mohon,56,,,56134000ZA0096,,,,,,,,,,,,,0,,,,,T,terres,,,3567,-2.527065,48.072748
2020-788787,2020-01-10,000001,Vente,900,,,LANDE DE SAINT MARC,C423,56490,56134,Mohon,56,,,56134000ZA0094,,,,,,,,,,,,,0,,,,,T,terres,,,2216,-2.526824,48.072349
2020-788875,2020-01-23,000001,Vente,25000,12,,LE GAZON,C055,56490,56134,Mohon,56,,,561340000C2018,,,,,,,,,,,,,0,1,Maison,150,4,S,sols,,,476,-2.477339,48.080796
2020-788875,2020-01-23,000001,Vente,25000,,,LE FRENAIS,C013,56490,56134,Mohon,56,,,561340000C2019,,,,,,,,,,,,,0,,,,,J,jardins,,,217,-2.477372,48.081019
2020-788909,2020-02-04,000001,Vente,152000,,,LA BUTTE DES CHENAUX,B120,56490,56134,Mohon,56,,,56134000ZI0047,,,,,,,,,,,,,0,,,,,L,landes,MARAI,Pré marais,1103,-2.508648,48.070813
2020-788909,2020-02-04,000001,Vente,152000,,,LA BUTTE DES CHENAUX,B120,56490,56134,Mohon,56,,,56134000ZI0047,,,,,,,,,,,,,0,,,,,T,terres,,,11041,-2.508648,48.070813
2020-788909,2020-02-04,000001,Vente,152000,,,LA BUTTE DES CHENAUX,B120,56490,56134,Mohon,56,,,56134000ZI0047,,,,,,,,,,,,,0,,,,,S,sols,,,6235,-2.508648,48.070813
2020-788909,2020-02-04,000001,Vente,152000,,,LA BUTTE DES CHENAUX,B120,56490,56134,Mohon,56,,,56134000ZI0047,,,,,,,,,,,,,0,,,,,T,terres,,,5521,-2.508648,48.070813
2020-788961,2020-01-30,000001,Vente,12500,,,LES COURTIEUX DE LA CHAPEL,D608,56490,56134,Mohon,56,,,56134000ZN0029,,,,,,,,,,,,,0,,,,,T,terres,,,490,-2.48335,48.082965
2020-788961,2020-01-30,000001,Vente,12500,,,LES COURTIEUX DE LA CHAPEL,D608,56490,56134,Mohon,56,,,56134000ZN0030,,,,,,,,,,,,,0,,,,,T,terres,,,1940,-2.483587,48.083009
2020-788961,2020-01-30,000001,Vente,12500,20,,LE GAZON,C055,56490,56134,Mohon,56,,,56134000ZN0031,,,,,,,,,,,,,0,1,Maison,36,2,T,terres,,,1030,-2.483871,48.083002
2020-788961,2020-01-30,000001,Vente,12500,20,,LE GAZON,C055,56490,56134,Mohon,56,,,56134000ZN0031,,,,,,,,,,,,,0,1,Maison,36,2,S,sols,,,290,-2.483871,48.083002
2020-788987,2020-02-10,000001,Vente,18000,,,LES PATURES DE FOUISSAGE,D631,56490,56134,Mohon,56,,,56134000YA0089,,,,,,,,,,,,,0,,,,,S,sols,,,882,-2.46762,48.039027
2020-788987,2020-02-10,000001,Vente,18000,26,,LINHO,C566,56490,56134,Mohon,56,,,56134000YA0090,,,,,,,,,,,,,0,1,Maison,45,2,S,sols,,,682,-2.467419,48.03864
2020-789008,2020-02-20,000001,Vente,75000,,,LES CHAMPS DES BRUYERES,D600,56490,56134,Mohon,56,,,56134000ZD0067,,,,,,,,,,,,,0,,,,,S,sols,,,3240,-2.510403,48.066623
2020-789145,2020-02-21,000001,Vente,131760,8,,RUE DU PARADIS,0030,56490,56134,Mohon,56,,,56134000AB0135,,,,,,,,,,,,,0,1,Maison,170,5,S,sols,,,486,-2.525765,48.050458
2020-789145,2020-02-21,000001,Vente,131760,,,RUE DU PARADIS,0030,56490,56134,Mohon,56,,,56134000AB0151,,,,,,,,,,,,,0,,,,,T,terres,,,1278,-2.526191,48.05048
2020-789145,2020-02-21,000001,Vente,131760,,,RUE DU PARADIS,0030,56490,56134,Mohon,56,,,56134000AB0151,,,,,,,,,,,,,0,,,,,S,sols,,,420,-2.526191,48.05048
2020-789145,2020-02-21,000001,Vente,131760,,,LE BOURG,B090,56490,56134,Mohon,56,,,56134000AB0398,,,,,,,,,,,,,0,,,,,S,sols,,,474,-2.525487,48.050626
2020-789226,2020-03-13,000001,Vente,17729.6,,,LA GRANDE CLAIE,C114,56490,56134,Mohon,56,,,56134000ZL0095,,,,,,,,,,,,,0,,,,,T,terres,,,23745,-2.494319,48.09186
2020-789226,2020-03-13,000001,Vente,17729.6,,,LA GRANDE CLAIE,C114,56490,56134,Mohon,56,,,56134000ZL0095,,,,,,,,,,,,,0,,,,,T,terres,,,7915,-2.494319,48.09186
2020-789262,2020-04-01,000001,Vente,85000,,,BULE OCTEE HAUTE VAIE,B107,56490,56134,Mohon,56,,,561340000F0847,,,,,,,,,,,,,0,,,,,T,terres,,,4820,-2.531746,48.067709
2020-789262,2020-04-01,000001,Vente,85000,,,LA VALLEE DE SAINT MARC,D533,56490,56134,Mohon,56,,,561340000F0848,,,,,,,,,,,,,0,,,,,T,terres,,,7559,-2.531716,48.066837
2020-789262,2020-04-01,000001,Vente,85000,,,BULE OCTEE HAUTE VAIE,B107,56490,56134,Mohon,56,,,561340000F0853,,,,,,,,,,,,,0,,,,,T,terres,,,22380,-2.52976,48.067257
2020-789262,2020-04-01,000001,Vente,85000,,,BULE OCTEE HAUTE VAIE,B107,56490,56134,Mohon,56,,,561340000F0859,,,,,,,,,,,,,0,,,,,T,terres,,,6912,-2.529299,48.069842
2020-789262,2020-04-01,000001,Vente,85000,,,BULE OCTEE HAUTE VAIE,B107,56490,56134,Mohon,56,,,561340000F0860,,,,,,,,,,,,,0,,,,,T,terres,,,5970,-2.528687,48.070054
2020-789262,2020-04-01,000001,Vente,85000,,,BULE OCTEE HAUTE VAIE,B107,56490,56134,Mohon,56,,,561340000F0863,,,,,,,,,,,,,0,,,,,BR,futaies résineuses,,,1577,-2.527815,48.069219
2020-789262,2020-04-01,000001,Vente,85000,,,BULE OCTEE HAUTE VAIE,B107,56490,56134,Mohon,56,,,561340000F1278,,,,,,,,,,,,,0,,,,,T,terres,,,1031,-2.531385,48.06699
2020-789262,2020-04-01,000001,Vente,85000,,,LE PATIS DE SAINT MARC,D596,56490,56134,Mohon,56,,,56134000ZB0017,,,,,,,,,,,,,0,,,,,T,terres,,,10463,-2.535928,48.064208
2020-789262,2020-04-01,000001,Vente,85000,,,LE PATIS DE SAINT MARC,D596,56490,56134,Mohon,56,,,56134000ZB0017,,,,,,,,,,,,,0,,,,,T,terres,,,10462,-2.535928,48.064208
2020-789262,2020-04-01,000001,Vente,85000,,,LA VALLEE DES BURNOUS,D601,56490,56134,Mohon,56,,,56134000ZE0075,,,,,,,,,,,,,0,,,,,L,landes,MARAI,Pré marais,2791,-2.526243,48.070757
2020-789262,2020-04-01,000001,Vente,85000,,,LA VALLEE DES BURNOUS,D601,56490,56134,Mohon,56,,,56134000ZE0075,,,,,,,,,,,,,0,,,,,T,terres,,,30954,-2.526243,48.070757
2020-789262,2020-04-01,000001,Vente,85000,,,LES ROTOUERS,D400,56490,56134,Mohon,56,,,56134000ZH0058,,,,,,,,,,,,,0,,,,,P,prés,,,5600,-2.523391,48.073266
2020-789262,2020-04-01,000001,Vente,85000,,,LES ROTOUERS,D400,56490,56134,Mohon,56,,,56134000ZH0063,,,,,,,,,,,,,0,,,,,P,prés,,,10940,-2.524104,48.075746
2020-789262,2020-04-01,000001,Vente,85000,,,LES ROTOUERS,D400,56490,56134,Mohon,56,,,56134000ZH0064,,,,,,,,,,,,,0,,,,,P,prés,,,4363,-2.52422,48.075947
2020-789262,2020-04-01,000001,Vente,85000,,,LES ROTOUERS,D400,56490,56134,Mohon,56,,,56134000ZH0064,,,,,,,,,,,,,0,,,,,P,prés,,,13087,-2.52422,48.075947
2020-789262,2020-04-01,000001,Vente,85000,,,LES ROTOUERS,D400,56490,56134,Mohon,56,,,56134000ZH0078,,,,,,,,,,,,,0,,,,,L,landes,,,10150,-2.525912,48.076435
2020-789262,2020-04-01,000001,Vente,85000,,,LES ROTOUERS,D400,56490,56134,Mohon,56,,,56134000ZH0079,,,,,,,,,,,,,0,,,,,L,landes,,,14225,-2.525829,48.075528
2020-789262,2020-04-01,000001,Vente,85000,,,LES ROTOUERS,D400,56490,56134,Mohon,56,,,56134000ZH0116,,,,,,,,,,,,,0,,,,,T,terres,,,3690,-2.521676,48.073979
2020-789262,2020-04-01,000001,Vente,85000,,,LES ROTOUERS,D400,56490,56134,Mohon,56,,,56134000ZH0116,,,,,,,,,,,,,0,,,,,T,terres,,,7380,-2.521676,48.073979
2020-789262,2020-04-01,000001,Vente,85000,,,LES ROTOUERS,D400,56490,56134,Mohon,56,,,56134000ZH0117,,,,,,,,,,,,,0,,,,,P,prés,,,7,-2.520866,48.074778
2020-789262,2020-04-01,000001,Vente,85000,,,LES ROTOUERS,D400,56490,56134,Mohon,56,,,56134000ZH0122,,,,,,,,,,,,,0,,,,,P,prés,,,9142,-2.522165,48.076313
2020-789262,2020-04-01,000001,Vente,85000,,,LES ROTOUERS,D400,56490,56134,Mohon,56,,,56134000ZH0122,,,,,,,,,,,,,0,,,,,T,terres,,,12332,-2.522165,48.076313
2020-789262,2020-04-01,000001,Vente,85000,,,LES ROTOUERS,D400,56490,56134,Mohon,56,,,56134000ZH0122,,,,,,,,,,,,,0,,,,,T,terres,,,24663,-2.522165,48.076313
2020-789262,2020-04-01,000001,Vente,85000,,,LES ROTOUERS,D400,56490,56134,Mohon,56,,,56134000ZH0122,,,,,,,,,,,,,0,,,,,P,prés,,,4570,-2.522165,48.076313
2020-789262,2020-04-01,000001,Vente,85000,,,LE CHENAIS,B492,56490,56134,Mohon,56,,,56134000ZI0013,,,,,,,,,,,,,0,,,,,T,terres,,,20770,-2.494168,48.074028
2020-789593,2020-05-29,000001,Vente,147000,15,,BREHELU,B093,56490,56134,Mohon,56,,,56134000YH0216,,,,,,,,,,,,,0,1,Maison,98,3,S,sols,,,616,-2.505424,48.028678
2020-789593,2020-05-29,000001,Vente,147000,15,,BREHELU,B093,56490,56134,Mohon,56,,,56134000YH0220,,,,,,,,,,,,,0,,,,,T,terres,,,5648,-2.505986,48.028961
2020-789593,2020-05-29,000001,Vente,147000,15,,BREHELU,B093,56490,56134,Mohon,56,,,56134000YH0220,,,,,,,,,,,,,0,,,,,S,sols,,,945,-2.505986,48.028961
2020-789593,2020-05-29,000001,Vente,147000,15,,BREHELU,B093,56490,56134,Mohon,56,,,56134000YH0222,,,,,,,,,,,,,0,,,,,T,terres,,,11885,-2.506094,48.029924
2020-789635,2020-06-02,000001,Vente,68000,13,,PENGUILY,C847,56490,56134,Mohon,56,,,56134000YC0008,,,,,,,,,,,,,0,1,Maison,33,2,T,terres,,,2745,-2.501396,48.045824
2020-789635,2020-06-02,000001,Vente,68000,13,,PENGUILY,C847,56490,56134,Mohon,56,,,56134000YC0008,,,,,,,,,,,,,0,1,Maison,33,2,S,sols,,,715,-2.501396,48.045824
2020-789635,2020-06-02,000001,Vente,68000,,,LA NOE,C632,56490,56134,Mohon,56,,,56134000YC0058,,,,,,,,,,,,,0,,,,,S,sols,,,292,-2.501748,48.045876
2020-789765,2020-07-06,000001,Vente,161200,3,,RUE DES COURTILS,0007,56490,56134,Mohon,56,,,56134000ZC0289,,,,,,,,,,,,,0,1,Maison,128,6,T,terres,,,645,-2.528061,48.053236
2020-789765,2020-07-06,000001,Vente,161200,3,,RUE DES COURTILS,0007,56490,56134,Mohon,56,,,56134000ZC0289,,,,,,,,,,,,,0,1,Maison,128,6,P,prés,,,1395,-2.528061,48.053236
2020-789765,2020-07-06,000001,Vente,161200,3,,RUE DES COURTILS,0007,56490,56134,Mohon,56,,,56134000ZC0289,,,,,,,,,,,,,0,1,Maison,128,6,AG,terrains d'agrément,,,500,-2.528061,48.053236
2020-789765,2020-07-06,000001,Vente,161200,3,,RUE DES COURTILS,0007,56490,56134,Mohon,56,,,56134000ZC0289,,,,,,,,,,,,,0,1,Maison,128,6,S,sols,,,500,-2.528061,48.053236
2020-789894,2020-07-15,000001,Vente,186603,,,LES GRANDES FOSSES,C147,56490,56134,Mohon,56,,,56134000AB0287,,,,,,,,,,,,,0,,,,,T,terres,,,3260,-2.526677,48.054846
2020-789894,2020-07-15,000001,Vente,186603,,,LES GRANDES FOSSES,C147,56490,56134,Mohon,56,,,56134000AB0287,,,,,,,,,,,,,0,,,,,S,sols,,,315,-2.526677,48.054846
2020-789894,2020-07-15,000001,Vente,186603,2,,RUE DU PORHOET,0037,56490,56134,Mohon,56,,,56134000AB0288,,,,,,,,,,,,,0,1,Maison,233,8,S,sols,,,2468,-2.527713,48.054841
2020-789894,2020-07-15,000001,Vente,186603,,,LES FOSSES,B989,56490,56134,Mohon,56,,,56134000ZC0181,,,,,,,,,,,,,0,,,,,T,terres,,,275,-2.52803,48.055047
2020-789894,2020-07-15,000001,Vente,186603,,,LES FOSSES,B989,56490,56134,Mohon,56,,,56134000ZC0182,,,,,,,,,,,,,0,,,,,T,terres,,,165,-2.527701,48.055006
2020-790029,2020-08-04,000001,Vente,10000,,,LES CHAMPS D ENVOL,D625,56490,56134,Mohon,56,,,56134000ZX0066,,,,,,,,,,,,,0,,,,,S,sols,,,3420,,
2020-790029,2020-08-04,000001,Vente,10000,,,LES CHAMPS D ENVOL,D625,56490,56134,Mohon,56,,,56134000ZX0066,,,,,,,,,,,,,0,,,,,T,terres,,,5820,,
2020-790029,2020-08-04,000001,Vente,10000,,,LES CHAMPS D ENVOL,D625,56490,56134,Mohon,56,,,56134000ZX0066,,,,,,,,,,,,,0,,,,,T,terres,,,5820,,
2020-790030,2020-08-04,000001,Vente,2000,,,LA VALLEE DU PONT CAROL,D620,56490,56134,Mohon,56,,,56134000ZV0184,,,,,,,,,,,,,0,,,,,S,sols,,,700,-2.496406,48.05991
2020-790030,2020-08-04,000001,Vente,2000,,,LA VALLEE DU PONT CAROL,D620,56490,56134,Mohon,56,,,56134000ZV0184,,,,,,,,,,,,,0,,,,,T,terres,,,1913,-2.496406,48.05991
2020-790030,2020-08-04,000001,Vente,2000,,,LA VALLEE DU PONT CAROL,D620,56490,56134,Mohon,56,,,56134000ZV0186,,,,,,,,,,,,,0,,,,,T,terres,,,377,-2.496826,48.059852
2020-790141,2020-08-24,000001,Vente,58000,3,,GARCELMONT,C037,56490,56134,Mohon,56,,,56134000ZL0051,,,,,,,,,,,,,0,1,Maison,48,3,S,sols,,,920,-2.505939,48.088051
2020-790141,2020-08-24,000001,Vente,58000,,,LES PRES DE L AUBEPINE,D606,56490,56134,Mohon,56,,,56134000ZL0105,,,,,,,,,,,,,0,,,,,S,sols,,,196,-2.50594,48.08826
2020-790156,2020-08-14,000001,Vente,111000,22,,RUE DES MARETIAUX,0024,56490,56134,Mohon,56,,,56134000ZC0343,,,,,,,,,,,,,0,1,Maison,70,4,S,sols,,,801,-2.524713,48.056574
2020-790373,2020-09-23,000001,Vente,110000,21,,LA MULOTIERE,C629,56490,56134,Mohon,56,,,56134000ZV0183,,,,,,,,,,,,,0,1,Maison,160,8,AG,terrains d'agrément,,,770,-2.496575,48.060445
2020-790373,2020-09-23,000001,Vente,110000,21,,LA MULOTIERE,C629,56490,56134,Mohon,56,,,56134000ZV0183,,,,,,,,,,,,,0,1,Maison,160,8,S,sols,,,1000,-2.496575,48.060445
2020-790373,2020-09-23,000001,Vente,110000,,,LA VALLEE DU PONT CAROL,D620,56490,56134,Mohon,56,,,56134000ZV0185,,,,,,,,,,,,,0,,,,,T,terres,,,235,-2.496942,48.0603
2020-790617,2020-10-09,000001,Vente,78980,,,LA CHAUSSEE,B482,56490,56134,Mohon,56,,,56134000ZM0003,,,,,,,,,,,,,0,,,,,T,terres,,,9810,-2.495388,48.101795
2020-790617,2020-10-09,000001,Vente,78980,,,LA CHAUSSEE,B482,56490,56134,Mohon,56,,,56134000ZM0003,,,,,,,,,,,,,0,,,,,P,prés,,,4036,-2.495388,48.101795
2020-790617,2020-10-09,000001,Vente,78980,,,LA CHAUSSEE,B482,56490,56134,Mohon,56,,,56134000ZM0003,,,,,,,,,,,,,0,,,,,T,terres,,,4904,-2.495388,48.101795
2020-790617,2020-10-09,000001,Vente,78980,,,LES GAUBUS,C053,56490,56134,Mohon,56,,,56134000ZM0007,,,,,,,,,,,,,0,,,,,T,terres,,,19495,-2.490959,48.099535
2020-790617,2020-10-09,000001,Vente,78980,,,LES GAUBUS,C053,56490,56134,Mohon,56,,,56134000ZM0007,,,,,,,,,,,,,0,,,,,S,sols,,,725,-2.490959,48.099535
2020-790762,2020-11-06,000001,Vente,180500,14,,LE CLOS DU TERTRE,B553,56490,56134,Mohon,56,,,56134000ZS0074,,,,,,,,,,,,,0,3,Dépendance,,0,S,sols,,,2000,-2.487979,48.075862
2020-790762,2020-11-06,000001,Vente,180500,14,,LE CLOS DU TERTRE,B553,56490,56134,Mohon,56,,,56134000ZS0074,,,,,,,,,,,,,0,1,Maison,115,5,S,sols,,,2000,-2.487979,48.075862
2020-790762,2020-11-06,000001,Vente,180500,14,,LE CLOS DU TERTRE,B553,56490,56134,Mohon,56,,,56134000ZS0074,,,,,,,,,,,,,0,3,Dépendance,,0,S,sols,,,2000,-2.487979,48.075862
2020-790762,2020-11-06,000001,Vente,180500,14,,LE CLOS DU TERTRE,B553,56490,56134,Mohon,56,,,56134000ZS0074,,,,,,,,,,,,,0,3,Dépendance,,0,S,sols,,,2000,-2.487979,48.075862
2020-790762,2020-11-06,000001,Vente,180500,,,LE QUERDRY,D365,56490,56134,Mohon,56,,,56134000ZS0152,,,,,,,,,,,,,0,,,,,T,terres,,,730,-2.488003,48.075686
2020-790838,2020-11-17,000001,Vente,25000,15,,LE GAZON,C055,56490,56134,Mohon,56,,,56134000ZS0081,,,,,,,,,,,,,0,1,Maison,94,4,S,sols,,,604,-2.477662,48.080454
2020-790919,2020-11-05,000001,Vente,58000,,,LE CHAMP DU HAUT,B349,56490,56134,Mohon,56,,,56134000YA0026,,,,,,,,,,,,,0,,,,,T,terres,,,13445,-2.469799,48.04034
2020-790919,2020-11-05,000001,Vente,58000,,,LE CHAMP DU HAUT,B349,56490,56134,Mohon,56,,,56134000YA0026,,,,,,,,,,,,,0,,,,,S,sols,,,1745,-2.469799,48.04034
2020-790926,2020-11-07,000001,Vente,38000,,,LANDE DE LA BARAILLE,D605,56490,56134,Mohon,56,,,56134000ZL0047,,,,,,,,,,,,,0,,,,,T,terres,,,5774,-2.5029,48.087993
2020-790926,2020-11-07,000001,Vente,38000,,,LANDE DE LA BARAILLE,D605,56490,56134,Mohon,56,,,56134000ZL0047,,,,,,,,,,,,,0,,,,,P,prés,,,4226,-2.5029,48.087993
2020-790926,2020-11-07,000001,Vente,38000,11,,GARCELMONT,C037,56490,56134,Mohon,56,,,56134000ZL0083,,,,,,,,,,,,,0,1,Maison,86,2,S,sols,,,1531,-2.503595,48.088745
2020-790928,2020-11-06,000001,Vente,80300,5,,COETSERVY,B645,56490,56134,Mohon,56,,,56134000ZV0060,,,,,,,,,,,,,0,3,Dépendance,,0,J,jardins,,,858,-2.496618,48.056665
2020-790928,2020-11-06,000001,Vente,80300,5,,COETSERVY,B645,56490,56134,Mohon,56,,,56134000ZV0060,,,,,,,,,,,,,0,3,Dépendance,,0,J,jardins,,,858,-2.496618,48.056665
2020-790928,2020-11-06,000001,Vente,80300,5,,COETSERVY,B645,56490,56134,Mohon,56,,,56134000ZV0060,,,,,,,,,,,,,0,1,Maison,100,5,S,sols,,,500,-2.496618,48.056665
2020-790928,2020-11-06,000001,Vente,80300,5,,COETSERVY,B645,56490,56134,Mohon,56,,,56134000ZV0060,,,,,,,,,,,,,0,3,Dépendance,,0,S,sols,,,500,-2.496618,48.056665
2020-790928,2020-11-06,000001,Vente,80300,5,,COETSERVY,B645,56490,56134,Mohon,56,,,56134000ZV0060,,,,,,,,,,,,,0,3,Dépendance,,0,S,sols,,,500,-2.496618,48.056665
2020-790928,2020-11-06,000001,Vente,80300,5,,COETSERVY,B645,56490,56134,Mohon,56,,,56134000ZV0060,,,,,,,,,,,,,0,3,Dépendance,,0,S,sols,,,500,-2.496618,48.056665
2020-790928,2020-11-06,000001,Vente,80300,5,,COETSERVY,B645,56490,56134,Mohon,56,,,56134000ZV0060,,,,,,,,,,,,,0,1,Maison,100,5,J,jardins,,,858,-2.496618,48.056665
2020-790928,2020-11-06,000001,Vente,80300,5,,COETSERVY,B645,56490,56134,Mohon,56,,,56134000ZV0060,,,,,,,,,,,,,0,3,Dépendance,,0,J,jardins,,,858,-2.496618,48.056665
2020-790950,2020-12-04,000001,Vente,40000,5,,RUE DU MOULIN,0049,56490,56134,Mohon,56,,,56134000AB0344,,,,,,,,,,,,,0,1,Maison,120,5,S,sols,,,202,-2.527142,48.051184
2020-790950,2020-12-04,000001,Vente,40000,,,LE BOURG,B090,56490,56134,Mohon,56,,,56134000AB0459,,,,,,,,,,,,,0,,,,,S,sols,,,270,-2.527161,48.051306
2020-790997,2020-11-18,000001,Vente,39000,4,,LA TOUCHE,D485,56490,56134,Mohon,56,,,56134000YD0082,,,,,,,,,,,,,0,1,Maison,93,4,S,sols,,,628,-2.506457,48.037389
2020-790997,2020-11-18,000001,Vente,39000,,,LES TREES COLICHES,D635,56490,56134,Mohon,56,,,56134000YD0083,,,,,,,,,,,,,0,,,,,S,sols,,,45,-2.506219,48.037192
2020-791067,2020-12-14,000001,Vente,77505,2,,RUE ST VRAN,0053,56490,56134,Mohon,56,,,56134000AB0436,,,,,,,,,,,,,0,1,Maison,100,4,S,sols,,,214,-2.527698,48.052513
2020-791067,2020-12-14,000001,Vente,77505,,,COURTIAU THOMAS,B671,56490,56134,Mohon,56,,,56134000AB0498,,,,,,,,,,,,,0,,,,,J,jardins,,,276,-2.527671,48.052729
2020-791067,2020-12-14,000001,Vente,77505,,,LE BOURG,B090,56490,56134,Mohon,56,,,56134000AB0500,,,,,,,,,,,,,0,,,,,S,sols,,,109,-2.527648,48.052414
2020-791067,2020-12-14,000001,Vente,77505,,,LE BOURG,B090,56490,56134,Mohon,56,,,56134000AB0501,,,,,,,,,,,,,0,,,,,S,sols,,,43,-2.527665,48.052392
2020-791081,2020-12-04,000001,Vente,33600,2,B,COURANT,B665,56490,56134,Mohon,56,,,56134000ZX0081,,,,,,,,,,,,,0,1,Maison,134,3,S,sols,,,277,-2.453964,48.043683
2020-791081,2020-12-04,000001,Vente,33600,,,LE DOMAINE,B935,56490,56134,Mohon,56,,,56134000ZX0082,,,,,,,,,,,,,0,,,,,S,sols,,,10,-2.453882,48.043725
2020-791083,2020-12-03,000001,Vente,268000,,,LA VALLEE DU PONT CAROL,D620,56490,56134,Mohon,56,,,56134000ZV0112,,,,,,,,,,,,,0,,,,,S,sols,,,11777,-2.495588,48.060069
2020-791083,2020-12-03,000001,Vente,268000,,,LA VALLEE DU PONT CAROL,D620,56490,56134,Mohon,56,,,56134000ZV0184,,,,,,,,,,,,,0,,,,,T,terres,,,1913,-2.496406,48.05991
2020-791083,2020-12-03,000001,Vente,268000,,,LA VALLEE DU PONT CAROL,D620,56490,56134,Mohon,56,,,56134000ZV0184,,,,,,,,,,,,,0,,,,,S,sols,,,700,-2.496406,48.05991
2020-791083,2020-12-03,000001,Vente,268000,,,LA VALLEE DU PONT CAROL,D620,56490,56134,Mohon,56,,,56134000ZV0186,,,,,,,,,,,,,0,,,,,T,terres,,,377,-2.496826,48.059852
2020-791161,2020-12-10,000001,Vente,65000,17,,RUE DU PORHOET,0037,56490,56134,Mohon,56,,,56134000ZC0287,,,,,,,,,,,,,0,1,Maison,115,4,S,sols,,,1773,-2.529061,48.055008
2020-791161,2020-12-10,000001,Vente,65000,17,,RUE DU PORHOET,0037,56490,56134,Mohon,56,,,56134000ZC0287,,,,,,,,,,,,,0,3,Dépendance,,0,S,sols,,,1773,-2.529061,48.055008
2020-791164,2020-12-07,000001,Vente,92000,1,,QUENOGE,D364,56490,56134,Mohon,56,,,56134000ZM0013,,,,,,,,,,,,,0,1,Maison,60,3,S,sols,,,6760,-2.493777,48.098848
2020-791184,2020-12-18,000001,Vente,372,,,LA GARENNE,C042,56490,56134,Mohon,56,,,56134000ZC0003,,,,,,,,,,,,,0,,,,,P,prés,,,1240,-2.535945,48.057312
2020-791265,2020-12-17,000001,Vente,35000,,,LE CLOS,B514,56490,56134,Mohon,56,,,56134000YH0214,,,,,,,,,,,,,0,,,,,S,sols,,,50,-2.505505,48.029079
2020-791265,2020-12-17,000001,Vente,35000,,,LE CLOS,B514,56490,56134,Mohon,56,,,56134000YH0214,,,,,,,,,,,,,0,,,,,T,terres,,,1035,-2.505505,48.029079
2020-791265,2020-12-17,000001,Vente,35000,16,,BREHELU,B093,56490,56134,Mohon,56,,,56134000YH0215,,,,,,,,,,,,,0,1,Maison,86,3,S,sols,,,750,-2.50524,48.028789
2020-791283,2020-12-23,000001,Vente,189000,7,,RUE DE LA PIERRE BISE,0033,56490,56134,Mohon,56,,,56134000ZC0072,,,,,,,,,,,,,0,1,Maison,209,7,S,sols,,,700,-2.522932,48.055291
2020-791283,2020-12-23,000001,Vente,189000,7,,RUE DE LA PIERRE BISE,0033,56490,56134,Mohon,56,,,56134000ZC0072,,,,,,,,,,,,,0,1,Maison,209,7,T,terres,,,1420,-2.522932,48.055291
2020-791283,2020-12-23,000001,Vente,189000,,,LES LONGUES RAYES,C572,56490,56134,Mohon,56,,,56134000ZC0195,,,,,,,,,,,,,0,,,,,T,terres,,,120,-2.522891,48.05502
2020-791350,2020-11-02,000001,Vente,127500,9,,BODEGAT,B047,56490,56134,Mohon,56,,,56134000ZC0176,,,,,,,,,,,,,0,1,Maison,130,7,J,jardins,,,900,-2.534405,48.055355
2020-791350,2020-11-02,000001,Vente,127500,9,,BODEGAT,B047,56490,56134,Mohon,56,,,56134000ZC0176,,,,,,,,,,,,,0,1,Maison,130,7,S,sols,,,600,-2.534405,48.055355
