id_mutation,date_mutation,numero_disposition,nature_mutation,valeur_fonciere,adresse_numero,adresse_suffixe,adresse_nom_voie,adresse_code_voie,code_postal,code_commune,nom_commune,code_departement,ancien_code_commune,ancien_nom_commune,id_parcelle,ancien_id_parcelle,numero_volume,lot1_numero,lot1_surface_carrez,lot2_numero,lot2_surface_carrez,lot3_numero,lot3_surface_carrez,lot4_numero,lot4_surface_carrez,lot5_numero,lot5_surface_carrez,nombre_lots,code_type_local,type_local,surface_reelle_bati,nombre_pieces_principales,code_nature_culture,nature_culture,code_nature_culture_speciale,nature_culture_speciale,surface_terrain,longitude,latitude
2020-794742,2020-03-06,000001,Vente,20000,,,LES ROCHES,B357,58310,58012,Arquian,58,,,58012000ZT0012,,,,,,,,,,,,,0,,,,,P,prés,,,3330,2.991897,47.538673
2020-794742,2020-03-06,000001,Vente,20000,,,LES ROCHES,B357,58310,58012,Arquian,58,,,58012000ZT0015,,,,,,,,,,,,,0,,,,,P,prés,,,4550,2.992473,47.538686
2020-794742,2020-03-06,000001,Vente,20000,,,LES ROCHES,B357,58310,58012,Arquian,58,,,58012000ZT0016,,,,,,,,,,,,,0,,,,,P,prés,,,27480,2.993506,47.538007
2020-794742,2020-03-06,000001,Vente,20000,,,MOULIN TENANT,B269,58310,58012,Arquian,58,,,58012000ZT0034,,,,,,,,,,,,,0,,,,,P,prés,,,57980,2.997831,47.53775
2020-794742,2020-03-06,000001,Vente,20000,,,MOULIN TENANT,B269,58310,58012,Arquian,58,,,58012000ZT0085,,,,,,,,,,,,,0,,,,,BS,taillis sous futaie,,,8801,2.995694,47.53873
2020-794742,2020-03-06,000001,Vente,20000,,,LES ANGES,B003,58310,58012,Arquian,58,,,58012000ZT0092,,,,,,,,,,,,,0,,,,,BS,taillis sous futaie,,,8383,3.001164,47.535447
2020-795115,2020-05-15,000001,Vente,21000,27,,RTE DE NEUVY,0105,58310,58012,Arquian,58,,,580120000A0952,,,,,,,,,,,,,0,1,Maison,148,5,S,sols,,,295,2.986551,47.541738
2020-795338,2020-05-25,000001,Vente,69000,8,,RTE DE LAVAU,0093,58310,58012,Arquian,58,,,580120000A0611,,,,,,,,,,,,,0,1,Maison,78,3,S,sols,,,1000,2.988571,47.543138
2020-795409,2020-05-28,000001,Vente,62000,15,,RTE DE ST AMAND,0110,58310,58012,Arquian,58,,,580120000A0778,,,,,,,,,,,,,0,1,Maison,70,2,S,sols,,,222,2.989814,47.541364
2020-795478,2020-06-20,000001,Vente,2000,,,CHAMP DE LA FILLEULE,B078,58310,58012,Arquian,58,,,58012000ZV0065,,,,,,,,,,,,,0,,,,,T,terres,,,3360,2.982137,47.537531
2020-796399,2020-08-10,000001,Vente,26000,39,,RTE DE ST AMAND,0110,58310,58012,Arquian,58,,,580120000A0670,,,,,,,,,,,,,0,1,Maison,40,3,S,sols,,,665,2.992809,47.540752
2020-796737,2020-09-04,000001,Vente,55000,,,BELLEVUE,B015,58310,58012,Arquian,58,,,580120000C0902,,,,,,,,,,,,,0,,,,,T,terres,,,282,3.024708,47.511465
2020-796737,2020-09-04,000001,Vente,55000,403,,BELLEVUE,B015,58310,58012,Arquian,58,,,580120000C0905,,,,,,,,,,,,,0,1,Maison,59,3,S,sols,,,390,3.024656,47.511437
2020-797073,2020-09-21,000001,Vente,2500,,,LES VARENNES,B390,58310,58012,Arquian,58,,,580120000A0645,,,,,,,,,,,,,0,,,,,T,terres,,,530,2.995551,47.541359
2020-797073,2020-09-21,000001,Vente,2500,,,CHAMP DE LA FILLEULE,B078,58310,58012,Arquian,58,,,58012000ZV0066,,,,,,,,,,,,,0,,,,,T,terres,,,4070,2.982371,47.537385
2020-797260,2020-09-11,000001,Vente,1000,,,GRANDE CHENEE,B219,58310,58012,Arquian,58,,,58012000ZD0007,,,,,,,,,,,,,0,,,,,T,terres,,,11210,3.025689,47.551945
2020-797344,2020-10-05,000001,Vente,4500,,,LE CHAMP RENAULT,B130,58310,58012,Arquian,58,,,580120000A0596,,,,,,,,,,,,,0,,,,,T,terres,,,327,2.987653,47.544072
2020-797344,2020-10-05,000001,Vente,4500,,,LE CHAMP RENAULT,B130,58310,58012,Arquian,58,,,580120000A0596,,,,,,,,,,,,,0,,,,,T,terres,,,328,2.987653,47.544072
2020-797344,2020-10-05,000001,Vente,4500,,,LE CHAMP RENAULT,B130,58310,58012,Arquian,58,,,580120000A0597,,,,,,,,,,,,,0,,,,,T,terres,,,1842,2.987893,47.544021
2020-797344,2020-10-05,000001,Vente,4500,,,LE CHAMP RENAULT,B130,58310,58012,Arquian,58,,,580120000A0597,,,,,,,,,,,,,0,,,,,T,terres,,,1843,2.987893,47.544021
2020-797640,2020-10-09,000001,Vente,154000,389,,LES BRIOUX,B045,58310,58012,Arquian,58,,,58012000ZK0011,,,,,,,,,,,,,0,1,Maison,160,6,S,sols,,,2826,3.020241,47.515971
2020-797640,2020-10-09,000001,Vente,154000,389,,LES BRIOUX,B045,58310,58012,Arquian,58,,,58012000ZK0011,,,,,,,,,,,,,0,1,Maison,160,6,P,prés,,,5163,3.020241,47.515971
2020-797640,2020-10-09,000001,Vente,154000,,,BOIS DES BRIOUX,B030,58310,58012,Arquian,58,,,58012000ZK0046,,,,,,,,,,,,,0,,,,,T,terres,,,131,3.020768,47.515765
2020-797963,2020-10-20,000001,Vente,182000,9,,RTE DU CHATEAU,0040,58310,58012,Arquian,58,,,580120000A1671,,,,,,,,,,,,,0,1,Maison,138,3,S,sols,,,1860,2.990672,47.545654
2020-797963,2020-10-20,000001,Vente,182000,9,,RTE DU CHATEAU,0040,58310,58012,Arquian,58,,,580120000A1671,,,,,,,,,,,,,0,1,Maison,138,3,T,terres,,,2345,2.990672,47.545654
2020-797963,2020-10-20,000001,Vente,182000,9,A,RTE DU CHATEAU,0040,58310,58012,Arquian,58,,,580120000A1688,,,,,,,,,,,,,0,3,Dépendance,,0,S,sols,,,320,2.990423,47.545257
2020-797963,2020-10-20,000001,Vente,182000,9,A,RTE DU CHATEAU,0040,58310,58012,Arquian,58,,,580120000A1688,,,,,,,,,,,,,0,3,Dépendance,,0,T,terres,,,1383,2.990423,47.545257
2020-797983,2020-11-02,000001,Vente,165000,,,LA BOULE D OR,B043,58310,58012,Arquian,58,,,580120000A0992,,,,,,,,,,,,,0,,,,,T,terres,,,10,2.983967,47.542685
2020-797983,2020-11-02,000001,Vente,165000,43,,RTE DE NEUVY,0105,58310,58012,Arquian,58,,,580120000A0993,,,,,,,,,,,,,0,1,Maison,33,2,S,sols,,,40,2.983937,47.542706
2020-797983,2020-11-02,000001,Vente,165000,,,LA BOULE D OR,B043,58310,58012,Arquian,58,,,580120000A1906,,,,,,,,,,,,,0,,,,,T,terres,,,1016,2.983526,47.54229
2020-797983,2020-11-02,000001,Vente,165000,,,LA BOULE D OR,B043,58310,58012,Arquian,58,,,580120000A1954,,,,,,,,,,,,,0,,,,,J,jardins,,,443,2.983503,47.542443
2020-797983,2020-11-02,000001,Vente,165000,43,A,RTE DE NEUVY,0105,58310,58012,Arquian,58,,,580120000A1958,,,,,,,,,,,,,0,1,Maison,156,3,S,sols,,,1614,2.983123,47.541995
2020-797985,2020-11-14,000001,Vente,95000,,,LE VALON,B388,58310,58012,Arquian,58,,,58012000ZE0003,,,,,,,,,,,,,0,,,,,T,terres,,,3433,3.025505,47.53805
2020-797985,2020-11-14,000001,Vente,95000,63,,RTE DE ST AMAND,0110,58310,58012,Arquian,58,,,58012000ZE0004,,,,,,,,,,,,,0,1,Maison,82,4,S,sols,,,486,3.025916,47.538084
2020-797985,2020-11-14,000001,Vente,95000,63,,RTE DE ST AMAND,0110,58310,58012,Arquian,58,,,58012000ZE0004,,,,,,,,,,,,,0,1,Maison,82,4,T,terres,,,2138,3.025916,47.538084
2020-798280,2020-11-27,000001,Vente,115000,18,,LA PETITE BORDE,B291,58310,58012,Arquian,58,,,58012000ZA0068,,,,,,,,,,,,,0,1,Maison,54,2,S,sols,,,1088,2.971625,47.55581
2020-798280,2020-11-27,000001,Vente,115000,,,LA PETITE BORDE,B291,58310,58012,Arquian,58,,,58012000ZA0070,,,,,,,,,,,,,0,,,,,S,sols,,,212,2.971778,47.555938
2020-798370,2020-11-30,000001,Vente,105000,2,,PETIT MOUSSU,B287,58310,58012,Arquian,58,,,58012000ZI0002,,,,,,,,,,,,,0,1,Maison,124,4,S,sols,,,1208,3.000381,47.529023
2020-798556,2020-12-12,000001,Vente,67000,,,CHAMP PLANCHET,B126,58310,58012,Arquian,58,,,580120000A0660,,,,,,,,,,,,,0,,,,,J,jardins,,,950,2.993096,47.539936
2020-798556,2020-12-12,000001,Vente,67000,38,,RTE DE ST AMAND,0110,58310,58012,Arquian,58,,,580120000A0661,,,,,,,,,,,,,0,1,Maison,75,3,S,sols,,,115,2.993195,47.540254
2020-798556,2020-12-12,000001,Vente,67000,,,CHAMP PLANCHET,B126,58310,58012,Arquian,58,,,580120000A1746,,,,,,,,,,,,,0,,,,,S,sols,,,83,2.993324,47.540245
2020-798678,2020-11-20,000001,Vente,85000,6,,RTE DES VALLOTS,0155,58310,58012,Arquian,58,,,58012000ZW0047,,,,,,,,,,,,,0,1,Maison,92,5,S,sols,,,1581,2.984575,47.537956
2020-798678,2020-11-20,000001,Vente,85000,6,,RTE DES VALLOTS,0155,58310,58012,Arquian,58,,,58012000ZW0047,,,,,,,,,,,,,0,1,Maison,92,5,P,prés,,,2764,2.984575,47.537956
2020-799204,2020-12-31,000001,Vente,3180,,,LA VALOTERIE,B389,58310,58012,Arquian,58,,,58012000ZS0015,,,,,,,,,,,,,0,,,,,T,terres,,,10600,2.986139,47.536
2020-799456,2020-02-03,000001,Vente,28690,,,L AVOINERIE,B006,58310,58012,Arquian,58,,,58012000ZL0062,,,,,,,,,,,,,0,,,,,T,terres,,,6570,2.998143,47.516065
2020-799456,2020-02-03,000001,Vente,28690,,,L AVOINERIE,B006,58310,58012,Arquian,58,,,58012000ZL0063,,,,,,,,,,,,,0,,,,,T,terres,,,2739,2.997122,47.515007
2020-799456,2020-02-03,000001,Vente,28690,,,L AVOINERIE,B006,58310,58012,Arquian,58,,,58012000ZL0064,,,,,,,,,,,,,0,,,,,T,terres,,,3927,2.997929,47.516809
2020-799456,2020-02-03,000001,Vente,28690,,,L AVOINERIE,B006,58310,58012,Arquian,58,,,58012000ZL0096,,,,,,,,,,,,,0,,,,,S,sols,,,952,2.995697,47.515742
2020-799456,2020-02-03,000001,Vente,28690,,,L AVOINERIE,B006,58310,58012,Arquian,58,,,58012000ZL0097,,,,,,,,,,,,,0,,,,,T,terres,,,30565,2.997025,47.516328
2020-799456,2020-02-03,000001,Vente,28690,,,LES BRULIS,B047,58310,58012,Arquian,58,,,58012000ZP0031,,,,,,,,,,,,,0,,,,,T,terres,,,9390,2.994189,47.513297
2020-799456,2020-02-03,000001,Vente,28690,,,LES BRULIS,B047,58310,58012,Arquian,58,,,58012000ZP0031,,,,,,,,,,,,,0,,,,,T,terres,,,9390,2.994189,47.513297
2020-799456,2020-02-03,000001,Vente,28690,,,LES BRULIS,B047,58310,58012,Arquian,58,,,58012000ZP0032,,,,,,,,,,,,,0,,,,,T,terres,,,23210,2.995095,47.514588
2020-799456,2020-02-03,000001,Vente,28690,,,LES BRULIS,B047,58310,58012,Arquian,58,,,58012000ZP0032,,,,,,,,,,,,,0,,,,,T,terres,,,23210,2.995095,47.514588
2020-799544,2020-02-22,000001,Vente,80000,,,PETIT MOUSSU,B287,58310,58012,Arquian,58,,,58012000ZH0037,,,,,,,,,,,,,0,,,,,T,terres,,,25658,2.999113,47.530356
2020-799544,2020-02-22,000001,Vente,80000,3,,PETIT MOUSSU,B287,58310,58012,Arquian,58,,,58012000ZH0040,,,,,,,,,,,,,0,1,Maison,1,5,S,sols,,,892,2.999839,47.529264
