id_mutation,date_mutation,numero_disposition,nature_mutation,valeur_fonciere,adresse_numero,adresse_suffixe,adresse_nom_voie,adresse_code_voie,code_postal,code_commune,nom_commune,code_departement,ancien_code_commune,ancien_nom_commune,id_parcelle,ancien_id_parcelle,numero_volume,lot1_numero,lot1_surface_carrez,lot2_numero,lot2_surface_carrez,lot3_numero,lot3_surface_carrez,lot4_numero,lot4_surface_carrez,lot5_numero,lot5_surface_carrez,nombre_lots,code_type_local,type_local,surface_reelle_bati,nombre_pieces_principales,code_nature_culture,nature_culture,code_nature_culture_speciale,nature_culture_speciale,surface_terrain,longitude,latitude
2020-795543,2020-06-18,000001,Vente,9000,,,LES MEOTS,B133,58500,58032,Billy-sur-Oisy,58,,,58032000YA0006,,,,,,,,,,,,,0,,,,,T,terres,,,8228,3.431087,47.474815
2020-795543,2020-06-18,000001,Vente,9000,,,LES MEOTS,B133,58500,58032,Billy-sur-Oisy,58,,,58032000YA0006,,,,,,,,,,,,,0,,,,,T,terres,,,8228,3.431087,47.474815
2020-795868,2020-06-19,000002,Vente,2700,,,LE BOURG,B018,58500,58032,Billy-sur-Oisy,58,,,58032000AE0238,,,,,,,,,,,,,0,,,,,T,terres,,,270,3.41651,47.480913
2020-795878,2020-06-26,000001,Vente,45000,,,LE BOURG,B018,58500,58032,Billy-sur-Oisy,58,,,58032000AH0004,,,,,,,,,,,,,0,,,,,J,jardins,,,144,3.409997,47.479847
2020-795878,2020-06-26,000001,Vente,45000,1,,PL DU POTEAU,0220,58500,58032,Billy-sur-Oisy,58,,,58032000AH0008,,,,,,,,,,,,,0,1,Maison,150,4,S,sols,,,155,3.410208,47.479459
2020-795878,2020-06-26,000001,Vente,45000,,,RUE DE DERRIERE LES MURS,0065,58500,58032,Billy-sur-Oisy,58,,,58032000AH0295,,,,,,,,,,,,,0,,,,,S,sols,,,20,3.410293,47.479394
2020-795904,2020-06-18,000001,Vente,5400,,,LE BOURG,B018,58500,58032,Billy-sur-Oisy,58,,,58032000AH0227,,,,,,,,,,,,,0,,,,,T,terres,,,1724,3.406701,47.478657
2020-795904,2020-06-18,000001,Vente,5400,,,LE FOUTY AU GOURDON,B104,58500,58032,Billy-sur-Oisy,58,,,58032000ZE0066,,,,,,,,,,,,,0,,,,,T,terres,,,16272,3.400185,47.486741
2020-795904,2020-06-18,000001,Vente,5400,,,VALLEE DES VAUX,B214,58500,58032,Billy-sur-Oisy,58,,,58032000ZE0212,,,,,,,,,,,,,0,,,,,T,terres,,,370,3.403913,47.482071
2020-795905,2020-06-18,000001,Vente,11600,,,LES MARTINOTTES,B131,58500,58032,Billy-sur-Oisy,58,,,58032000ZE0075,,,,,,,,,,,,,0,,,,,T,terres,,,23199,3.400765,47.484193
2020-795905,2020-06-18,000001,Vente,11600,,,LES MARTINOTTES,B131,58500,58032,Billy-sur-Oisy,58,,,58032000ZE0075,,,,,,,,,,,,,0,,,,,L,landes,,,1490,3.400765,47.484193
2020-795905,2020-06-18,000001,Vente,11600,,,LES CHITRY,B070,58500,58032,Billy-sur-Oisy,58,,,58032000ZK0080,,,,,,,,,,,,,0,,,,,T,terres,,,14905,3.399088,47.477822
2020-795905,2020-06-18,000001,Vente,11600,,,LES CHITRY,B070,58500,58032,Billy-sur-Oisy,58,,,58032000ZK0180,,,,,,,,,,,,,0,,,,,T,terres,,,2332,3.397413,47.478003
2020-796048,2020-07-04,000001,Vente,12750,,,LE BOURG,B018,58500,58032,Billy-sur-Oisy,58,,,58032000AE0227,,,,,,,,,,,,,0,,,,,T,terres,,,1327,3.418351,47.480919
2020-796070,2020-06-30,000001,Vente,55000,1,,LA MOTTE,B137,58500,58032,Billy-sur-Oisy,58,,,58032000AI0020,,,,,,,,,,,,,0,1,Maison,80,3,S,sols,,,1590,3.403133,47.473641
2020-796070,2020-06-30,000001,Vente,55000,,,LA MOTTE,B137,58500,58032,Billy-sur-Oisy,58,,,58032000AI0021,,,,,,,,,,,,,0,,,,,P,prés,,,2075,3.402754,47.473383
2020-796200,2020-07-08,000001,Vente,3000,,,LA PENOTTE AUX POIS,B150,58500,58032,Billy-sur-Oisy,58,,,58032000ZL0018,,,,,,,,,,,,,0,,,,,T,terres,,,5870,3.363459,47.464078
2020-796200,2020-07-08,000001,Vente,3000,,,LA PENOTTE AUX POIS,B150,58500,58032,Billy-sur-Oisy,58,,,58032000ZL0018,,,,,,,,,,,,,0,,,,,T,terres,,,5870,3.363459,47.464078
2020-796345,2020-07-10,000001,Vente,1500,,,MARTOIS,B132,58500,58032,Billy-sur-Oisy,58,,,58032000ZE0033,,,,,,,,,,,,,0,,,,,T,terres,,,2490,3.411427,47.481995
2020-796345,2020-07-10,000001,Vente,1500,,,LES MARTINOTTES,B131,58500,58032,Billy-sur-Oisy,58,,,58032000ZE0071,,,,,,,,,,,,,0,,,,,T,terres,,,2882,3.402868,47.486296
2020-796448,2020-07-23,000001,Vente,22500,,,CHARMOIS,B057,58500,58032,Billy-sur-Oisy,58,,,58032000AC0055,,,,,,,,,,,,,0,,,,,T,terres,,,875,3.434039,47.49838
2020-796448,2020-07-23,000001,Vente,22500,,,CHARMOIS,B057,58500,58032,Billy-sur-Oisy,58,,,58032000AC0057,,,,,,,,,,,,,0,,,,,T,terres,,,2045,3.434541,47.498476
2020-796448,2020-07-23,000001,Vente,22500,2,,RUE DU COLOMBIER,0052,58500,58032,Billy-sur-Oisy,58,,,58032000AC0058,,,,,,,,,,,,,0,1,Maison,78,3,S,sols,,,1204,3.43474,47.498269
2020-796965,2020-09-19,000001,Vente,1000,,,LA PIECE DU CHATEAU,B155,58500,58032,Billy-sur-Oisy,58,,,58032000ZH0186,,,,,,,,,,,,,0,,,,,P,prés,,,3760,3.410397,47.477339
2020-796972,2020-09-19,000001,Vente,25000,5,,PL DU POTEAU,0220,58500,58032,Billy-sur-Oisy,58,,,58032000AH0349,,,,,,,,,,,,,0,1,Maison,80,3,S,sols,,,649,3.410339,47.478912
2020-796972,2020-09-19,000001,Vente,25000,,,LE BOURG,B018,58500,58032,Billy-sur-Oisy,58,,,58032000AH0350,,,,,,,,,,,,,0,,,,,S,sols,,,110,3.410164,47.478986
2020-797075,2020-09-24,000001,Vente,,209,,CHARMOIS,B057,58500,58032,Billy-sur-Oisy,58,,,58032000AC0114,,,,,,,,,,,,,0,3,Dépendance,,0,S,sols,,,104,3.434274,47.497858
2020-797075,2020-09-24,000002,Vente,,,,CHARMOIS,B057,58500,58032,Billy-sur-Oisy,58,,,58032000AC0113,,,,,,,,,,,,,0,,,,,S,sols,,,661,3.434445,47.498015
2020-797075,2020-09-24,000002,Vente,,,,CHARMOIS,B057,58500,58032,Billy-sur-Oisy,58,,,58032000AC0115,,,,,,,,,,,,,0,,,,,T,terres,,,834,3.435122,47.498099
2020-797720,2020-10-28,000001,Vente,83600,5,,RUE DE LA BRECHE,0027,58500,58032,Billy-sur-Oisy,58,,,58032000AH0071,,,,,,,,,,,,,0,1,Maison,78,3,S,sols,,,637,3.413464,47.480524
2020-797742,2020-10-30,000001,Vente,,,,LES VAUX CORNERAUX,B219,58500,58032,Billy-sur-Oisy,58,,,58032000AD0075,,,,,,,,,,,,,0,,,,,L,landes,,,967,3.436201,47.485692
2020-797742,2020-10-30,000001,Vente,,,,LES VAUX CORNERAUX,B219,58500,58032,Billy-sur-Oisy,58,,,58032000AD0075,,,,,,,,,,,,,0,,,,,T,terres,,,378,3.436201,47.485692
2020-797742,2020-10-30,000001,Vente,,,,LES VAUX CORNERAUX,B219,58500,58032,Billy-sur-Oisy,58,,,58032000AD0085,,,,,,,,,,,,,0,,,,,L,landes,,,526,3.436912,47.485484
2020-797742,2020-10-30,000001,Vente,,,,SUR CUL FRAIS,B090,58500,58032,Billy-sur-Oisy,58,,,58032000AD0090,,,,,,,,,,,,,0,,,,,L,landes,,,238,3.438251,47.48541
2020-797742,2020-10-30,000001,Vente,,,,EN SAVON,B196,58500,58032,Billy-sur-Oisy,58,,,58032000AD0145,,,,,,,,,,,,,0,,,,,T,terres,,,71,3.436564,47.483105
2020-797742,2020-10-30,000001,Vente,,,,EN SAVON,B196,58500,58032,Billy-sur-Oisy,58,,,58032000AD0145,,,,,,,,,,,,,0,,,,,L,landes,,,481,3.436564,47.483105
2020-797742,2020-10-30,000001,Vente,,,,SUR LA GARE,B108,58500,58032,Billy-sur-Oisy,58,,,58032000AD0232,,,,,,,,,,,,,0,,,,,L,landes,,,505,3.431388,47.484009
2020-797742,2020-10-30,000001,Vente,,,,SUR LA GARE,B108,58500,58032,Billy-sur-Oisy,58,,,58032000AD0237,,,,,,,,,,,,,0,,,,,L,landes,,,300,3.431184,47.483904
2020-797742,2020-10-30,000001,Vente,,,,LES GRANDS CHAMPS,B115,58500,58032,Billy-sur-Oisy,58,,,58032000YB0062,,,,,,,,,,,,,0,,,,,T,terres,,,7633,3.428229,47.481093
2020-797742,2020-10-30,000001,Vente,,,,LES GRANDS CHAMPS,B115,58500,58032,Billy-sur-Oisy,58,,,58032000YB0062,,,,,,,,,,,,,0,,,,,T,terres,,,7633,3.428229,47.481093
2020-797742,2020-10-30,000001,Vente,,,,LE VERGER OUDEAU,B233,58500,58032,Billy-sur-Oisy,58,,,58032000ZD0013,,,,,,,,,,,,,0,,,,,T,terres,,,10274,3.414513,47.495761
2020-797742,2020-10-30,000001,Vente,,,,LE VERGER OUDEAU,B233,58500,58032,Billy-sur-Oisy,58,,,58032000ZD0013,,,,,,,,,,,,,0,,,,,T,terres,,,10274,3.414513,47.495761
2020-797742,2020-10-30,000001,Vente,,,,PRES CHEVAU,B174,58500,58032,Billy-sur-Oisy,58,,,58032000ZH0053,,,,,,,,,,,,,0,,,,,BT,taillis simples,,,667,3.404152,47.474694
2020-797742,2020-10-30,000001,Vente,,,,LES REVENUS,B185,58500,58032,Billy-sur-Oisy,58,,,58032000ZK0014,,,,,,,,,,,,,0,,,,,T,terres,,,9818,3.396236,47.483171
2020-797742,2020-10-30,000002,Vente,,,,SUR CUL FRAIS,B090,58500,58032,Billy-sur-Oisy,58,,,58032000AD0122,,,,,,,,,,,,,0,,,,,T,terres,,,266,3.43717,47.48449
2020-797742,2020-10-30,000002,Vente,,,,LE BOURG,B018,58500,58032,Billy-sur-Oisy,58,,,58032000AH0168,,,,,,,,,,,,,0,,,,,P,prés,,,2848,3.414693,47.477899
2020-797742,2020-10-30,000002,Vente,,,,VALLEE DES VAUX,B214,58500,58032,Billy-sur-Oisy,58,,,58032000ZE0220,,,,,,,,,,,,,0,,,,,T,terres,,,992,3.4068,47.481191
2020-797742,2020-10-30,000002,Vente,,,,COUTAS DES VAUX,B079,58500,58032,Billy-sur-Oisy,58,,,58032000ZE0297,,,,,,,,,,,,,0,,,,,L,landes,,,230,3.404439,47.482471
2020-797742,2020-10-30,000002,Vente,,,,PRES CHEVAU,B174,58500,58032,Billy-sur-Oisy,58,,,58032000ZH0073,,,,,,,,,,,,,0,,,,,T,terres,,,318,3.405819,47.475894
2020-797742,2020-10-30,000002,Vente,,,,LES OSIERS,B142,58500,58032,Billy-sur-Oisy,58,,,58032000ZH0133,,,,,,,,,,,,,0,,,,,T,terres,,,260,3.408418,47.476746
2020-797742,2020-10-30,000002,Vente,,,,LE PROU BLANC,B180,58500,58032,Billy-sur-Oisy,58,,,58032000ZI0016,,,,,,,,,,,,,0,,,,,T,terres,,,16656,3.407542,47.467081
2020-797742,2020-10-30,000002,Vente,,,,LES CHITRY,B070,58500,58032,Billy-sur-Oisy,58,,,58032000ZK0185,,,,,,,,,,,,,0,,,,,T,terres,,,1788,3.398278,47.477845
2020-798436,2020-12-05,000001,Vente,34000,,,LE BOURG,B018,58500,58032,Billy-sur-Oisy,58,,,58032000AH0016,,,,,,,,,,,,,0,,,,,L,landes,,,250,3.410576,47.480211
2020-798436,2020-12-05,000001,Vente,34000,111,,LE BOURG,B018,58500,58032,Billy-sur-Oisy,58,,,58032000AH0017,,,,,,,,,,,,,0,3,Dépendance,,0,S,sols,,,82,3.41063,47.479979
2020-798436,2020-12-05,000001,Vente,34000,4,,RUE DE DERRIERE LES MURS,0065,58500,58032,Billy-sur-Oisy,58,,,58032000AH0307,,,,,,,,,,,,,0,1,Maison,60,2,S,sols,,,185,3.410147,47.479595
2020-798903,2020-12-26,000001,Vente,78000,,,CHARMOIS,B057,58500,58032,Billy-sur-Oisy,58,,,58032000AC0080,,,,,,,,,,,,,0,,,,,T,terres,,,1055,3.432579,47.496416
2020-798903,2020-12-26,000001,Vente,78000,,,CHARMOIS,B057,58500,58032,Billy-sur-Oisy,58,,,58032000AC0081,,,,,,,,,,,,,0,,,,,T,terres,,,2321,3.432313,47.496272
2020-798903,2020-12-26,000001,Vente,78000,7,,RUE DES DEUX PINS,0068,58500,58032,Billy-sur-Oisy,58,,,58032000AC0082,,,,,,,,,,,,,0,1,Maison,86,4,S,sols,,,595,3.4321,47.496642
2020-798903,2020-12-26,000001,Vente,78000,5,,RUE DES DEUX PINS,0068,58500,58032,Billy-sur-Oisy,58,,,58032000AC0083,,,,,,,,,,,,,0,1,Maison,40,1,S,sols,,,518,3.431951,47.496672
2020-799253,2020-01-15,000001,Vente,5000,,,A FONDELIN,B098,58500,58032,Billy-sur-Oisy,58,,,58032000ZL0098,,,,,,,,,,,,,0,,,,,S,sols,,,666,3.353536,47.46615
2020-799280,2020-01-03,000001,Vente,10000,,,LE BOURG,B018,58500,58032,Billy-sur-Oisy,58,,,58032000AE0235,,,,,,,,,,,,,0,,,,,T,terres,,,1132,3.418044,47.480757
2020-799297,2020-01-31,000001,Vente,2000,,,A LA VIGNELLE,B237,58500,58032,Billy-sur-Oisy,58,,,58032000ZL0159,,,,,,,,,,,,,0,,,,,T,terres,,,244,3.364149,47.467478
2020-799297,2020-01-31,000001,Vente,2000,171,,A LA VIGNELLE,B237,58500,58032,Billy-sur-Oisy,58,,,58032000ZL0190,,,,,,,,,,,,,0,3,Dépendance,,0,S,sols,,,125,3.364715,47.467334
2020-799352,2020-02-22,000001,Vente,105000,11,,GR GRANDE RUE,0150,58500,58032,Billy-sur-Oisy,58,,,58032000AH0309,,,,,,,,,,,,,0,1,Maison,200,6,S,sols,,,329,3.411925,47.479643
2020-799352,2020-02-22,000001,Vente,105000,,,LE BOURG,B018,58500,58032,Billy-sur-Oisy,58,,,58032000AH0310,,,,,,,,,,,,,0,,,,,J,jardins,,,92,3.41188,47.479811
