id_mutation,date_mutation,numero_disposition,nature_mutation,valeur_fonciere,adresse_numero,adresse_suffixe,adresse_nom_voie,adresse_code_voie,code_postal,code_commune,nom_commune,code_departement,ancien_code_commune,ancien_nom_commune,id_parcelle,ancien_id_parcelle,numero_volume,lot1_numero,lot1_surface_carrez,lot2_numero,lot2_surface_carrez,lot3_numero,lot3_surface_carrez,lot4_numero,lot4_surface_carrez,lot5_numero,lot5_surface_carrez,nombre_lots,code_type_local,type_local,surface_reelle_bati,nombre_pieces_principales,code_nature_culture,nature_culture,code_nature_culture_speciale,nature_culture_speciale,surface_terrain,longitude,latitude
2020-794139,2020-01-21,000001,Vente,6240,,,BOIS DU MONT,B018,58230,58205,Ouroux-en-Morvan,58,,,58205000AR0009,,,,,,,,,,,,,0,,,,,T,terres,,,22140,3.956015,47.203144
2020-794185,2020-01-29,000001,Vente,700,,,BOULOIS,B029,58230,58205,Ouroux-en-Morvan,58,,,58205000AH0085,,,,,,,,,,,,,0,,,,,BR,futaies résineuses,,,3421,3.961972,47.220246
2020-794186,2020-01-29,000001,Vente,10284,,,LE HAUT DE ROULLE,B161,58230,58205,Ouroux-en-Morvan,58,,,58205000BT0260,,,,,,,,,,,,,0,,,,,T,terres,,,1714,3.936471,47.185557
2020-794329,2020-02-14,000001,Vente,40000,,,LE BOURG,B030,58230,58205,Ouroux-en-Morvan,58,,,58205000BR0032,,,,,,,,,,,,,0,,,,,S,sols,,,20,3.947125,47.184622
2020-794329,2020-02-14,000001,Vente,40000,,,LE BOURG,B030,58230,58205,Ouroux-en-Morvan,58,,,58205000BR0040,,,,,,,,,,,,,0,,,,,J,jardins,,,283,3.947146,47.184731
2020-794329,2020-02-14,000001,Vente,40000,,,LE BOURG,B030,58230,58205,Ouroux-en-Morvan,58,,,58205000BR0155,,,,,,,,,,,,,0,,,,,T,terres,,,1345,3.947389,47.184644
2020-794329,2020-02-14,000001,Vente,40000,3,,AV DE LA CROIX DE LA MISSION,0135,58230,58205,Ouroux-en-Morvan,58,,,58205000BR0156,,,,,,,,,,,,,0,1,Maison,96,5,S,sols,,,354,3.947455,47.184932
2020-794329,2020-02-14,000001,Vente,40000,5,,AV DE LA CROIX DE LA MISSION,0135,58230,58205,Ouroux-en-Morvan,58,,,58205000BR0157,,,,,,,,,,,,,0,3,Dépendance,,0,S,sols,,,235,3.947304,47.184857
2020-794335,2020-02-12,000001,Vente,28000,356,,COEUZON,B076,58230,58205,Ouroux-en-Morvan,58,,,58205000AX0033,,,,,,,,,,,,,0,1,Maison,49,3,S,sols,,,1420,3.979152,47.179208
2020-794378,2020-02-12,000002,Echange,7117.7,,,LA PERRIERE,B214,58230,58205,Ouroux-en-Morvan,58,,,58205000BO0287,,,,,,,,,,,,,0,,,,,L,landes,,,3410,3.944307,47.177598
2020-794379,2020-02-12,000003,Echange,3858,,,BOIS DE LA ROCHE GUIARD,B009,58230,58205,Ouroux-en-Morvan,58,,,58205000CP0144,,,,,,,,,,,,,0,,,,,BS,taillis sous futaie,,,27860,3.939257,47.208094
2020-794383,2020-02-12,000007,Echange,1403.4,,,PATURE DES VERNOIS,B212,58230,58205,Ouroux-en-Morvan,58,,,58205000BE0183,,,,,,,,,,,,,0,,,,,L,landes,,,3555,3.984338,47.162532
2020-794383,2020-02-12,000007,Echange,1403.4,,,PATURE DES VERNOIS,B212,58230,58205,Ouroux-en-Morvan,58,,,58205000BE0184,,,,,,,,,,,,,0,,,,,P,prés,,,8140,3.983785,47.162761
2020-794477,2020-02-19,000001,Vente,1970,,,BOIS DE LA RAMEE,B007,58230,58205,Ouroux-en-Morvan,58,,,58205000BC0020,,,,,,,,,,,,,0,,,,,BS,taillis sous futaie,,,1805,3.996859,47.166735
2020-794477,2020-02-19,000001,Vente,1970,,,BOIS DE LA RAMEE,B007,58230,58205,Ouroux-en-Morvan,58,,,58205000BC0022,,,,,,,,,,,,,0,,,,,BS,taillis sous futaie,,,6509,3.995458,47.166277
2020-794478,2020-02-19,000002,Vente,3230,,,SUR MONDRAY,B182,58230,58205,Ouroux-en-Morvan,58,,,58205000BC0123,,,,,,,,,,,,,0,,,,,BS,taillis sous futaie,,,2950,3.986654,47.167442
2020-794478,2020-02-19,000002,Vente,3230,,,MOULIN DES PRES MOUSSE,B206,58230,58205,Ouroux-en-Morvan,58,,,58205000BE0012,,,,,,,,,,,,,0,,,,,BS,taillis sous futaie,,,4575,3.984411,47.166582
2020-794478,2020-02-19,000002,Vente,3230,,,MOULIN DES PRES MOUSSE,B206,58230,58205,Ouroux-en-Morvan,58,,,58205000BE0013,,,,,,,,,,,,,0,,,,,BS,taillis sous futaie,,,4165,3.984448,47.166
2020-794478,2020-02-19,000002,Vente,3230,,,PATURE DES VERNOIS,B212,58230,58205,Ouroux-en-Morvan,58,,,58205000BE0191,,,,,,,,,,,,,0,,,,,BT,taillis simples,,,1980,3.983293,47.164383
2020-794608,2020-03-07,000001,Vente,500,,,MONT MORIN,B192,58230,58205,Ouroux-en-Morvan,58,,,58205000CO0259,,,,,,,,,,,,,0,,,,,BR,futaies résineuses,,,4939,3.93316,47.202547
2020-794617,2020-03-10,000001,Vente,2000,,,LE BONDY,B023,58230,58205,Ouroux-en-Morvan,58,,,58205000BD0066,,,,,,,,,,,,,0,,,,,BS,taillis sous futaie,,,19834,3.970846,47.174304
2020-794969,2020-05-12,000001,Vente,2500,,,LA SAUVE,B271,58230,58205,Ouroux-en-Morvan,58,,,58205000BO0112,,,,,,,,,,,,,0,,,,,L,landes,,,7415,3.959883,47.169973
2020-795274,2020-05-25,000001,Vente,1500,,,LES CORSERY,B080,58230,58205,Ouroux-en-Morvan,58,,,58205000BD0127,,,,,,,,,,,,,0,,,,,BS,taillis sous futaie,,,1355,3.97982,47.173998
2020-795274,2020-05-25,000001,Vente,1500,,,LES COUPERY,B085,58230,58205,Ouroux-en-Morvan,58,,,58205000BD0128,,,,,,,,,,,,,0,,,,,BR,futaies résineuses,,,14100,3.979154,47.173383
2020-795274,2020-05-25,000001,Vente,1500,,,LES COUPERY,B085,58230,58205,Ouroux-en-Morvan,58,,,58205000BD0131,,,,,,,,,,,,,0,,,,,BS,taillis sous futaie,,,725,3.980041,47.172975
2020-795586,2020-06-23,000001,Vente,40000,7,,IMP DE LA TUILERIE,0210,58230,58205,Ouroux-en-Morvan,58,,,58205000AT0035,,,,,,,,,,,,,0,1,Maison,87,4,S,sols,,,935,3.957792,47.183052
2020-795586,2020-06-23,000001,Vente,40000,,,LA TUILERIE,B280,58230,58205,Ouroux-en-Morvan,58,,,58205000AT0036,,,,,,,,,,,,,0,,,,,T,terres,,,7075,3.958367,47.183047
2020-795665,2020-06-30,000001,Vente,1800,,,BOIS DE LA ROCHE GUIARD,B009,58230,58205,Ouroux-en-Morvan,58,,,58205000CP0149,,,,,,,,,,,,,0,,,,,BS,taillis sous futaie,,,7474,3.937968,47.209196
2020-795938,2020-07-17,000001,Vente,4000,,,LES CREUX,B094,58230,58205,Ouroux-en-Morvan,58,,,58205000CO0281,,,,,,,,,,,,,0,,,,,T,terres,,,17665,3.931117,47.200827
2020-795938,2020-07-17,000001,Vente,4000,,,LES CREUX,B094,58230,58205,Ouroux-en-Morvan,58,,,58205000CO0282,,,,,,,,,,,,,0,,,,,T,terres,,,10965,3.931391,47.199285
2020-796215,2020-07-30,000001,Vente,291500,,,MURGERS,B208,58230,58205,Ouroux-en-Morvan,58,,,58205000BH0043,,,,,,,,,,,,,0,,,,,T,terres,,,4270,3.980169,47.160215
2020-796215,2020-07-30,000001,Vente,291500,,,MURGERS,B208,58230,58205,Ouroux-en-Morvan,58,,,58205000BH0044,,,,,,,,,,,,,0,,,,,T,terres,,,2041,3.979851,47.159752
2020-796215,2020-07-30,000001,Vente,291500,,,MURGERS,B208,58230,58205,Ouroux-en-Morvan,58,,,58205000BH0046,,,,,,,,,,,,,0,,,,,T,terres,,,5445,3.979622,47.159193
2020-796215,2020-07-30,000001,Vente,291500,,,MURGERS,B208,58230,58205,Ouroux-en-Morvan,58,,,58205000BH0047,,,,,,,,,,,,,0,,,,,T,terres,,,2449,3.980622,47.15919
2020-796215,2020-07-30,000001,Vente,291500,390,A,POIROT DESSUS,B223,58230,58205,Ouroux-en-Morvan,58,,,58205000BH0048,,,,,,,,,,,,,0,1,Maison,224,6,S,sols,,,575,3.980913,47.159018
2020-796215,2020-07-30,000001,Vente,291500,,,MURGERS,B208,58230,58205,Ouroux-en-Morvan,58,,,58205000BH0049,,,,,,,,,,,,,0,,,,,T,terres,,,2870,3.980772,47.159458
2020-796331,2020-08-06,000001,Vente,1500,,,POIROT DESSOUS,B222,58230,58205,Ouroux-en-Morvan,58,,,58205000BI0071,,,,,,,,,,,,,0,,,,,S,sols,,,1020,3.967283,47.15555
2020-796421,2020-06-12,000001,Vente,5000,,,BOIS DE LA VENTE GUILLARD,B010,58230,58205,Ouroux-en-Morvan,58,,,58205000AY0105,,,,,,,,,,,,,0,,,,,BS,taillis sous futaie,,,4834,4.003282,47.180728
2020-796421,2020-06-12,000001,Vente,5000,,,BOIS DE LA VENTE GUILLARD,B010,58230,58205,Ouroux-en-Morvan,58,,,58205000AY0106,,,,,,,,,,,,,0,,,,,BS,taillis sous futaie,,,4960,4.003405,47.181388
2020-796422,2020-07-23,000001,Vente,16000,6,,RUE DU PANORAMA,0195,58230,58205,Ouroux-en-Morvan,58,,,58205000BR0001,,,,,,,,,,,,,0,1,Maison,45,1,S,sols,,,50,3.945262,47.185869
2020-796422,2020-07-23,000001,Vente,16000,11,,RTE DE LORMES,0175,58230,58205,Ouroux-en-Morvan,58,,,58205000BT0117,,,,,,,,,,,,,0,,,,,J,jardins,,,633,3.942932,47.186704
2020-796423,2020-06-24,000003,Vente,1500,9001,,LE BOURG,B030,58230,58205,Ouroux-en-Morvan,58,,,58205000BT0196,,,,,,,,,,,,,0,4,Local industriel. commercial ou assimilé,60,0,S,sols,,,249,3.942454,47.186733
2020-796701,2020-09-01,000001,Vente,170000,,,L HUIS LHARDY,B166,58230,58205,Ouroux-en-Morvan,58,,,58205000CK0252,,,,,,,,,,,,,0,,,,,S,sols,,,62,3.91099,47.191845
2020-796701,2020-09-01,000001,Vente,170000,546,A,L HUIS LHARDY,B166,58230,58205,Ouroux-en-Morvan,58,,,58205000CK0253,,,,,,,,,,,,,0,1,Maison,104,4,T,terres,,,2765,3.911374,47.191748
2020-796701,2020-09-01,000001,Vente,170000,,,L HUIS LHARDY,B166,58230,58205,Ouroux-en-Morvan,58,,,58205000CK0256,,,,,,,,,,,,,0,,,,,S,sols,,,208,3.910868,47.191732
2020-796701,2020-09-01,000001,Vente,170000,545,,L HUIS LHARDY,B166,58230,58205,Ouroux-en-Morvan,58,,,58205000CK0257,,,,,,,,,,,,,0,1,Maison,45,1,S,sols,,,139,3.910772,47.191683
2020-796701,2020-09-01,000001,Vente,170000,,,L HUIS LHARDY,B166,58230,58205,Ouroux-en-Morvan,58,,,58205000CK0258,,,,,,,,,,,,,0,,,,,S,sols,,,116,3.910919,47.191613
2020-796701,2020-09-01,000001,Vente,170000,,,L HUIS LHARDY,B166,58230,58205,Ouroux-en-Morvan,58,,,58205000CK0281,,,,,,,,,,,,,0,,,,,S,sols,,,29,3.910685,47.191564
2020-796701,2020-09-01,000001,Vente,170000,,,L HUIS LHARDY,B166,58230,58205,Ouroux-en-Morvan,58,,,58205000CK0282,,,,,,,,,,,,,0,,,,,S,sols,,,68,3.910792,47.191547
2020-796701,2020-09-01,000001,Vente,170000,,,L HUIS LHARDY,B166,58230,58205,Ouroux-en-Morvan,58,,,58205000CK0284,,,,,,,,,,,,,0,,,,,S,sols,,,496,3.910995,47.191504
2020-796790,2020-09-11,000001,Vente,2000,,,LES CHENES,B073,58230,58205,Ouroux-en-Morvan,58,,,58205000CE0065,,,,,,,,,,,,,0,,,,,T,terres,,,6430,3.910354,47.184924
2020-796790,2020-09-11,000001,Vente,2000,,,LA FAYE,B131,58230,58205,Ouroux-en-Morvan,58,,,58205000CE0171,,,,,,,,,,,,,0,,,,,BS,taillis sous futaie,,,1397,3.909582,47.184939
2020-796790,2020-09-11,000001,Vente,2000,,,PRE COULARD,B230,58230,58205,Ouroux-en-Morvan,58,,,58205000CH0209,,,,,,,,,,,,,0,,,,,BS,taillis sous futaie,,,2382,3.903111,47.190048
2020-796915,2020-09-17,000001,Vente,3350,,,BOIS D ENSEIGNE,B011,58230,58205,Ouroux-en-Morvan,58,,,58205000BM0135,,,,,,,,,,,,,0,,,,,BS,taillis sous futaie,,,2064,3.932063,47.157613
2020-796915,2020-09-17,000001,Vente,3350,,,BOIS DES BROSSES,B014,58230,58205,Ouroux-en-Morvan,58,,,58205000BN0012,,,,,,,,,,,,,0,,,,,BS,taillis sous futaie,,,9095,3.938237,47.179717
2020-796915,2020-09-17,000001,Vente,3350,,,LA PERRIERE,B214,58230,58205,Ouroux-en-Morvan,58,,,58205000BO0276,,,,,,,,,,,,,0,,,,,L,landes,,,11215,3.942607,47.178366
2020-796915,2020-09-17,000001,Vente,3350,,,LA PERRIERE,B214,58230,58205,Ouroux-en-Morvan,58,,,58205000BO0277,,,,,,,,,,,,,0,,,,,T,terres,,,2915,3.943044,47.179018
2020-796915,2020-09-17,000001,Vente,3350,,,LA RESSE DE JALLOIS,B262,58230,58205,Ouroux-en-Morvan,58,,,58205000BO0301,,,,,,,,,,,,,0,,,,,T,terres,,,453,3.954087,47.178874
2020-796917,2020-09-17,000001,Vente,250,,,BOIS DES BROSSES,B014,58230,58205,Ouroux-en-Morvan,58,,,58205000BN0014,,,,,,,,,,,,,0,,,,,BS,taillis sous futaie,,,836,3.939264,47.180171
2020-796917,2020-09-17,000001,Vente,250,,,BOIS DES BROSSES,B014,58230,58205,Ouroux-en-Morvan,58,,,58205000BN0025,,,,,,,,,,,,,0,,,,,BS,taillis sous futaie,,,1151,3.939627,47.179744
2020-796918,2020-09-03,000001,Vente,45000,,,MONT,B183,58230,58205,Ouroux-en-Morvan,58,,,58205000BZ0113,,,,,,,,,,,,,0,,,,,S,sols,,,168,3.904492,47.178387
2020-796918,2020-09-03,000001,Vente,45000,513,,MONT,B183,58230,58205,Ouroux-en-Morvan,58,,,58205000BZ0114,,,,,,,,,,,,,0,1,Maison,60,2,S,sols,,,223,3.904644,47.178516
2020-796918,2020-09-03,000001,Vente,45000,,,MONT,B183,58230,58205,Ouroux-en-Morvan,58,,,58205000BZ0115,,,,,,,,,,,,,0,,,,,T,terres,,,1838,3.904298,47.178773
2020-796919,2020-09-18,000001,Vente,1400,,,BOIS DE THARE,B013,58230,58205,Ouroux-en-Morvan,58,,,58205000BO0263,,,,,,,,,,,,,0,,,,,BS,taillis sous futaie,,,5875,3.942051,47.176091
2020-796919,2020-09-18,000001,Vente,1400,,,LA PERRIERE,B214,58230,58205,Ouroux-en-Morvan,58,,,58205000BO0275,,,,,,,,,,,,,0,,,,,L,landes,,,3240,3.942033,47.177387
2020-797166,2020-10-01,000001,Vente,5000,,,VIZAINE,B295,58230,58205,Ouroux-en-Morvan,58,,,58205000CK0301,,,,,,,,,,,,,0,,,,,S,sols,,,570,3.920662,47.196744
2020-797166,2020-10-01,000001,Vente,5000,,,VIZAINE,B295,58230,58205,Ouroux-en-Morvan,58,,,58205000CK0302,,,,,,,,,,,,,0,,,,,P,prés,,,64,3.920501,47.196837
2020-797166,2020-10-01,000001,Vente,5000,,,VIZAINE,B295,58230,58205,Ouroux-en-Morvan,58,,,58205000CK0304,,,,,,,,,,,,,0,,,,,P,prés,,,395,3.920735,47.196492
2020-797166,2020-10-01,000001,Vente,5000,,,VIZAINE,B295,58230,58205,Ouroux-en-Morvan,58,,,58205000CK0305,,,,,,,,,,,,,0,,,,,S,sols,,,103,3.920835,47.196596
2020-797443,2020-10-01,000001,Vente,1000,,,LES PRES POLLET,B254,58230,58205,Ouroux-en-Morvan,58,,,58205000CO0174,,,,,,,,,,,,,0,,,,,BS,taillis sous futaie,,,2165,3.931145,47.20743
2020-797443,2020-10-01,000001,Vente,1000,,,LES PRES POLLET,B254,58230,58205,Ouroux-en-Morvan,58,,,58205000CO0200,,,,,,,,,,,,,0,,,,,BS,taillis sous futaie,,,6235,3.934175,47.207845
2020-797443,2020-10-01,000001,Vente,1000,,,BOIS DE LA ROCHE GUIARD,B009,58230,58205,Ouroux-en-Morvan,58,,,58205000CP0152,,,,,,,,,,,,,0,,,,,P,prés,,,2120,3.935135,47.20952
2020-797443,2020-10-01,000001,Vente,1000,,,BOIS DE LA ROCHE GUIARD,B009,58230,58205,Ouroux-en-Morvan,58,,,58205000CP0154,,,,,,,,,,,,,0,,,,,P,prés,,,1990,3.93505,47.209815
2020-797444,2020-10-01,000001,Vente,15000,,,LES COUPES,B083,58230,58205,Ouroux-en-Morvan,58,,,58205000CI0016,,,,,,,,,,,,,0,,,,,BS,taillis sous futaie,,,12890,3.9117,47.204668
2020-797444,2020-10-01,000001,Vente,15000,,,LES COUPES,B083,58230,58205,Ouroux-en-Morvan,58,,,58205000CI0017,,,,,,,,,,,,,0,,,,,BS,taillis sous futaie,,,12155,3.910874,47.204113
2020-797444,2020-10-01,000001,Vente,15000,,,LES COUPES,B083,58230,58205,Ouroux-en-Morvan,58,,,58205000CI0018,,,,,,,,,,,,,0,,,,,BS,taillis sous futaie,,,13880,3.910368,47.20406
2020-797444,2020-10-01,000001,Vente,15000,,,LES COUPES,B083,58230,58205,Ouroux-en-Morvan,58,,,58205000CI0028,,,,,,,,,,,,,0,,,,,BS,taillis sous futaie,,,6455,3.913106,47.204789
2020-797444,2020-10-01,000001,Vente,15000,,,CHAMPTE,B066,58230,58205,Ouroux-en-Morvan,58,,,58205000CI0031,,,,,,,,,,,,,0,,,,,BT,taillis simples,,,39,3.914302,47.205062
2020-797550,2020-10-19,000001,Vente,110000,,,SAVELOT,B297,58230,58205,Ouroux-en-Morvan,58,,,58205000AV0065,,,,,,,,,,,,,0,,,,,S,sols,,,958,3.983253,47.188837
2020-797550,2020-10-19,000001,Vente,110000,,,SAVELOT,B297,58230,58205,Ouroux-en-Morvan,58,,,58205000AV0066,,,,,,,,,,,,,0,,,,,T,terres,,,6120,3.9826,47.188586
2020-797550,2020-10-19,000001,Vente,110000,,,MOULIN DE SAVELOT,B205,58230,58205,Ouroux-en-Morvan,58,,,58205000AV0067,,,,,,,,,,,,,0,,,,,P,prés,,,14320,3.980867,47.189803
2020-797550,2020-10-19,000001,Vente,110000,,,SAVELOT,B297,58230,58205,Ouroux-en-Morvan,58,,,58205000AW0202,,,,,,,,,,,,,0,,,,,T,terres,,,2445,3.984362,47.189452
2020-797550,2020-10-19,000001,Vente,110000,336,,SAVELOT,B297,58230,58205,Ouroux-en-Morvan,58,,,58205000AW0258,,,,,,,,,,,,,0,1,Maison,99,4,S,sols,,,1323,3.983614,47.188953
2020-797550,2020-10-19,000001,Vente,110000,,,LES RUISSEAUX,B268,58230,58205,Ouroux-en-Morvan,58,,,58205000AX0092,,,,,,,,,,,,,0,,,,,BT,taillis simples,,,1261,3.98693,47.187494
2020-797550,2020-10-19,000001,Vente,110000,,,LES RUISSEAUX,B268,58230,58205,Ouroux-en-Morvan,58,,,58205000AX0096,,,,,,,,,,,,,0,,,,,BS,taillis sous futaie,,,5843,3.987711,47.187278
2020-797591,2020-10-22,000001,Vente,30881,,,LE CROT NOIR,B100,58230,58205,Ouroux-en-Morvan,58,,,58205000AI0148,,,,,,,,,,,,,0,,,,,BT,taillis simples,,,3495,3.944637,47.221746
2020-797591,2020-10-22,000001,Vente,30881,,,MONTSAVAULT,B195,58230,58205,Ouroux-en-Morvan,58,,,58205000AI0179,,,,,,,,,,,,,0,,,,,BS,taillis sous futaie,,,3997,3.943826,47.223614
2020-797591,2020-10-22,000001,Vente,30881,,,LES BOULAS,B028,58230,58205,Ouroux-en-Morvan,58,,,58205000CP0001,,,,,,,,,,,,,0,,,,,BS,taillis sous futaie,,,5006,3.937205,47.223149
2020-797591,2020-10-22,000001,Vente,30881,,,LES BOULAS,B028,58230,58205,Ouroux-en-Morvan,58,,,58205000CP0010,,,,,,,,,,,,,0,,,,,BS,taillis sous futaie,,,2699,3.937303,47.220863
2020-797591,2020-10-22,000001,Vente,30881,,,LES BOULAS,B028,58230,58205,Ouroux-en-Morvan,58,,,58205000CP0026,,,,,,,,,,,,,0,,,,,BS,taillis sous futaie,,,1087,3.936343,47.220582
2020-797621,2020-10-27,000001,Vente,109875,,,JALLOIS,B169,58230,58205,Ouroux-en-Morvan,58,,,58205000BP0095,,,,,,,,,,,,,0,,,,,T,terres,,,4014,3.945516,47.179234
2020-797621,2020-10-27,000001,Vente,109875,629,,JALLOIS,B169,58230,58205,Ouroux-en-Morvan,58,,,58205000BP0096,,,,,,,,,,,,,0,1,Maison,71,4,S,sols,,,281,3.945101,47.179471
2020-797621,2020-10-27,000001,Vente,109875,629,,JALLOIS,B169,58230,58205,Ouroux-en-Morvan,58,,,58205000BP0096,,,,,,,,,,,,,0,1,Maison,71,4,J,jardins,,,704,3.945101,47.179471
2020-797621,2020-10-27,000001,Vente,109875,,,JALLOIS,B169,58230,58205,Ouroux-en-Morvan,58,,,58205000BP0098,,,,,,,,,,,,,0,,,,,S,sols,,,566,3.944943,47.179728
2020-797621,2020-10-27,000001,Vente,109875,,,JALLOIS,B169,58230,58205,Ouroux-en-Morvan,58,,,58205000BP0099,,,,,,,,,,,,,0,,,,,L,landes,,,142,3.944737,47.179808
2020-797804,2020-10-28,000001,Vente,87520,,,BOULOIS,B029,58230,58205,Ouroux-en-Morvan,58,,,58205000AH0112,,,,,,,,,,,,,0,,,,,P,prés,,,155,3.958633,47.220405
2020-797804,2020-10-28,000001,Vente,87520,216,,BOULOIS,B029,58230,58205,Ouroux-en-Morvan,58,,,58205000AH0114,,,,,,,,,,,,,0,1,Maison,65,3,S,sols,,,343,3.958496,47.220259
2020-797804,2020-10-28,000001,Vente,87520,,,BOULOIS,B029,58230,58205,Ouroux-en-Morvan,58,,,58205000AH0119,,,,,,,,,,,,,0,,,,,P,prés,,,229,3.958421,47.220531
2020-797897,2020-11-06,000001,Vente,57000,9,,RUE DU COMMERCE,0130,58230,58205,Ouroux-en-Morvan,58,,,58205000BR0005,,,,,,,,,,,,,0,4,Local industriel. commercial ou assimilé,33,0,S,sols,,,205,3.945644,47.185628
2020-797897,2020-11-06,000001,Vente,57000,9,,RUE DU COMMERCE,0130,58230,58205,Ouroux-en-Morvan,58,,,58205000BR0005,,,,,,,,,,,,,0,1,Maison,63,4,S,sols,,,205,3.945644,47.185628
2020-798167,2020-11-06,000001,Vente,750,,,LA SAUVE,B271,58230,58205,Ouroux-en-Morvan,58,,,58205000BO0130,,,,,,,,,,,,,0,,,,,BT,taillis simples,,,2619,3.957329,47.1699
2020-798309,2020-11-25,000001,Vente,210000,,,LE VERNET DES LARRETS,B289,58230,58205,Ouroux-en-Morvan,58,,,58205000CD0002,,,,,,,,,,,,,0,,,,,B,bois,,,4000,3.884925,47.178662
2020-798309,2020-11-25,000001,Vente,210000,,,LE VERNET DES LARRETS,B289,58230,58205,Ouroux-en-Morvan,58,,,58205000CD0002,,,,,,,,,,,,,0,,,,,B,bois,,,16394,3.884925,47.178662
2020-798309,2020-11-25,000001,Vente,210000,,,LE VERNET DES LARRETS,B289,58230,58205,Ouroux-en-Morvan,58,,,58205000CD0002,,,,,,,,,,,,,0,,,,,B,bois,,,2000,3.884925,47.178662
2020-798309,2020-11-25,000001,Vente,210000,,,LE VERNET DES LARRETS,B289,58230,58205,Ouroux-en-Morvan,58,,,58205000CD0002,,,,,,,,,,,,,0,,,,,BR,futaies résineuses,,,16000,3.884925,47.178662
2020-798309,2020-11-25,000001,Vente,210000,,,LE VERNET DES LARRETS,B289,58230,58205,Ouroux-en-Morvan,58,,,58205000CD0002,,,,,,,,,,,,,0,,,,,BS,taillis sous futaie,,,65576,3.884925,47.178662
2020-798309,2020-11-25,000001,Vente,210000,,,LE VERNET DES LARRETS,B289,58230,58205,Ouroux-en-Morvan,58,,,58205000CD0002,,,,,,,,,,,,,0,,,,,BR,futaies résineuses,,,8000,3.884925,47.178662
2020-798309,2020-11-25,000001,Vente,210000,,,MONTREMAIN,B194,58230,58205,Ouroux-en-Morvan,58,,,58205000CD0241,,,,,,,,,,,,,0,,,,,B,bois,,,10995,3.891221,47.179193
2020-798309,2020-11-25,000001,Vente,210000,,,MONTREMAIN,B194,58230,58205,Ouroux-en-Morvan,58,,,58205000CD0243,,,,,,,,,,,,,0,,,,,B,bois,,,127840,3.889469,47.1774
2020-798427,2020-11-18,000001,Vente terrain à bâtir,1550,,,LA CROIX DE LA MISSION,B097,58230,58205,Ouroux-en-Morvan,58,,,58205000BO0311,,,,,,,,,,,,,0,,,,,T,terres,,,7722,3.949924,47.180169
2020-798505,2020-12-10,000001,Vente,1200,,,LES HATTES,B158,58230,58205,Ouroux-en-Morvan,58,,,58205000BZ0142,,,,,,,,,,,,,0,,,,,L,landes,,,2953,3.906362,47.180271
2020-798567,2020-11-23,000001,Vente,1600,,,LE BONDY,B023,58230,58205,Ouroux-en-Morvan,58,,,58205000BD0260,,,,,,,,,,,,,0,,,,,BS,taillis sous futaie,,,4755,3.97329,47.174815
2020-798568,2020-11-23,000001,Echange,3600,,,BOIS DE LA RAMEE,B007,58230,58205,Ouroux-en-Morvan,58,,,58205000BC0020,,,,,,,,,,,,,0,,,,,BS,taillis sous futaie,,,1805,3.996859,47.166735
2020-798568,2020-11-23,000001,Echange,3600,,,BOIS DE LA RAMEE,B007,58230,58205,Ouroux-en-Morvan,58,,,58205000BC0022,,,,,,,,,,,,,0,,,,,BS,taillis sous futaie,,,6509,3.995458,47.166277
2020-798568,2020-11-23,000001,Echange,3600,,,BOIS DE THARE,B013,58230,58205,Ouroux-en-Morvan,58,,,58205000BO0257,,,,,,,,,,,,,0,,,,,BS,taillis sous futaie,,,10330,3.944297,47.175848
2020-798569,2020-11-23,000002,Echange,2000,,,LES COUPERY,B085,58230,58205,Ouroux-en-Morvan,58,,,58205000BD0130,,,,,,,,,,,,,0,,,,,BR,futaies résineuses,,,4765,3.979429,47.172665
2020-798628,2020-12-01,000001,Vente,1250,,,LA PERRIERE,B214,58230,58205,Ouroux-en-Morvan,58,,,58205000BO0279,,,,,,,,,,,,,0,,,,,BT,taillis simples,,,290,3.944689,47.178938
2020-798628,2020-12-01,000001,Vente,1250,,,LA PERRIERE,B214,58230,58205,Ouroux-en-Morvan,58,,,58205000BO0283,,,,,,,,,,,,,0,,,,,T,terres,,,3370,3.944562,47.178546
2020-798628,2020-12-01,000001,Vente,1250,,,LA PERRIERE,B214,58230,58205,Ouroux-en-Morvan,58,,,58205000BO0284,,,,,,,,,,,,,0,,,,,T,terres,,,3385,3.943703,47.178787
2020-798668,2020-12-17,000001,Vente,165000,,,LA FORET DE CHICOT,B136,58230,58205,Ouroux-en-Morvan,58,,,58205000BC0080,,,,,,,,,,,,,0,,,,,BS,taillis sous futaie,,,1398,3.995385,47.164788
2020-798668,2020-12-17,000001,Vente,165000,,,MURGERS,B208,58230,58205,Ouroux-en-Morvan,58,,,58205000BH0050,,,,,,,,,,,,,0,,,,,T,terres,,,2975,3.981353,47.159566
2020-798668,2020-12-17,000001,Vente,165000,389,,MURGERS,B208,58230,58205,Ouroux-en-Morvan,58,,,58205000BH0052,,,,,,,,,,,,,0,1,Maison,137,7,S,sols,,,2075,3.981749,47.15896
2020-798670,2020-12-18,000001,Vente,9000,,,LE PRE L EAU,B239,58230,58205,Ouroux-en-Morvan,58,,,58205000AS0028,,,,,,,,,,,,,0,,,,,P,prés,,,22145,3.963108,47.193966
2020-798670,2020-12-18,000001,Vente,9000,,,LE PRE L EAU,B239,58230,58205,Ouroux-en-Morvan,58,,,58205000AS0029,,,,,,,,,,,,,0,,,,,BT,taillis simples,,,2175,3.960839,47.194784
2020-798670,2020-12-18,000001,Vente,9000,,,LE PRE L EAU,B239,58230,58205,Ouroux-en-Morvan,58,,,58205000AS0030,,,,,,,,,,,,,0,,,,,P,prés,,,49785,3.960698,47.194962
2020-798670,2020-12-18,000001,Vente,9000,,,LE LICHARD,B170,58230,58205,Ouroux-en-Morvan,58,,,58205000AS0142,,,,,,,,,,,,,0,,,,,BS,taillis sous futaie,,,1340,3.960844,47.195579
2020-798670,2020-12-18,000001,Vente,9000,,,LE LICHARD,B170,58230,58205,Ouroux-en-Morvan,58,,,58205000AS0143,,,,,,,,,,,,,0,,,,,BS,taillis sous futaie,,,780,3.964121,47.194502
2020-798671,2020-12-18,000001,Vente,5000,,,LES VERNOIS,B292,58230,58205,Ouroux-en-Morvan,58,,,58205000AT0146,,,,,,,,,,,,,0,,,,,BT,taillis simples,,,883,3.960733,47.178398
2020-798671,2020-12-18,000001,Vente,5000,,,LES VERNOIS,B292,58230,58205,Ouroux-en-Morvan,58,,,58205000AT0147,,,,,,,,,,,,,0,,,,,BR,futaies résineuses,,,3095,3.96085,47.178893
2020-798671,2020-12-18,000001,Vente,5000,,,LES VERNOIS,B292,58230,58205,Ouroux-en-Morvan,58,,,58205000AT0148,,,,,,,,,,,,,0,,,,,L,landes,,,4630,3.960975,47.179491
2020-798671,2020-12-18,000001,Vente,5000,,,LE PRE DE SENNECOT,B232,58230,58205,Ouroux-en-Morvan,58,,,58205000AW0117,,,,,,,,,,,,,0,,,,,BR,futaies résineuses,,,8490,4.001888,47.193506
2020-798671,2020-12-18,000001,Vente,5000,,,LES PRES DU MITTAN,B251,58230,58205,Ouroux-en-Morvan,58,,,58205000AW0158,,,,,,,,,,,,,0,,,,,BT,taillis simples,,,2045,3.991624,47.191673
2020-798671,2020-12-18,000001,Vente,5000,,,LES PRES DU MITTAN,B251,58230,58205,Ouroux-en-Morvan,58,,,58205000AW0159,,,,,,,,,,,,,0,,,,,P,prés,,,5850,3.991224,47.191875
2020-798671,2020-12-18,000001,Vente,5000,,,LES PRES DU MITTAN,B251,58230,58205,Ouroux-en-Morvan,58,,,58205000AW0160,,,,,,,,,,,,,0,,,,,P,prés,,,1760,3.990834,47.191384
2020-798671,2020-12-18,000001,Vente,5000,,,LES PRES DU MITTAN,B251,58230,58205,Ouroux-en-Morvan,58,,,58205000AW0161,,,,,,,,,,,,,0,,,,,BT,taillis simples,,,538,3.991155,47.191176
2020-798671,2020-12-18,000001,Vente,5000,,,LES PRES DU MITTAN,B251,58230,58205,Ouroux-en-Morvan,58,,,58205000AW0162,,,,,,,,,,,,,0,,,,,BT,taillis simples,,,1075,3.990675,47.19088