id_mutation,date_mutation,numero_disposition,nature_mutation,valeur_fonciere,adresse_numero,adresse_suffixe,adresse_nom_voie,adresse_code_voie,code_postal,code_commune,nom_commune,code_departement,ancien_code_commune,ancien_nom_commune,id_parcelle,ancien_id_parcelle,numero_volume,lot1_numero,lot1_surface_carrez,lot2_numero,lot2_surface_carrez,lot3_numero,lot3_surface_carrez,lot4_numero,lot4_surface_carrez,lot5_numero,lot5_surface_carrez,nombre_lots,code_type_local,type_local,surface_reelle_bati,nombre_pieces_principales,code_nature_culture,nature_culture,code_nature_culture_speciale,nature_culture_speciale,surface_terrain,longitude,latitude
2020-795417,2020-06-16,000001,Vente,5013,,,LES EUMES,B085,58360,58219,Préporché,58,,,58219000ZH0026,,,,,,,,,,,,,0,,,,,P,prés,,,33420,3.876075,46.939753
2020-795686,2020-06-23,000001,Vente,26000,206,,ACHE,B001,58360,58219,Préporché,58,,,58219000ZX0017,,,,,,,,,,,,,0,1,Maison,73,2,S,sols,,,1580,3.86525,46.929367
2020-795686,2020-06-23,000001,Vente,26000,,,ACHE,B001,58360,58219,Préporché,58,,,58219000ZX0018,,,,,,,,,,,,,0,,,,,P,prés,,,480,3.865075,46.929119
2020-795688,2020-06-24,000001,Vente,3500,,,VILLARS,B183,58360,58219,Préporché,58,,,58219000ZI0051,,,,,,,,,,,,,0,,,,,P,prés,,,2890,3.879783,46.936312
2020-795688,2020-06-24,000001,Vente,3500,,,VILLARS,B183,58360,58219,Préporché,58,,,58219000ZI0054,,,,,,,,,,,,,0,,,,,P,prés,,,2080,3.879286,46.936541
2020-795797,2020-06-26,000001,Vente,304000,218,B,LES COUSSONS,B071,58360,58219,Préporché,58,,,58219000ZT0050,,,,,,,,,,,,,0,4,Local industriel. commercial ou assimilé,374,0,S,sols,,,758,3.856914,46.918656
2020-795797,2020-06-26,000001,Vente,304000,218,B,LES COUSSONS,B071,58360,58219,Préporché,58,,,58219000ZT0050,,,,,,,,,,,,,0,1,Maison,86,3,S,sols,,,758,3.856914,46.918656
2020-795797,2020-06-26,000001,Vente,304000,,,LES COUSSONS,B071,58360,58219,Préporché,58,,,58219000ZT0084,,,,,,,,,,,,,0,,,,,J,jardins,,,688,3.856951,46.918813
2020-795797,2020-06-26,000001,Vente,304000,,,LES COUSSONS,B071,58360,58219,Préporché,58,,,58219000ZT0084,,,,,,,,,,,,,0,,,,,S,sols,,,500,3.856951,46.918813
2020-795797,2020-06-26,000001,Vente,304000,,,LES COUSSONS,B071,58360,58219,Préporché,58,,,58219000ZT0085,,,,,,,,,,,,,0,,,,,P,prés,,,163,3.857134,46.918894
2020-796305,2020-07-31,000001,Vente,14000,,,LES GRANDS BOIS,B101,58360,58219,Préporché,58,,,58219000YC0073,,,,,,,,,,,,,0,,,,,BS,taillis sous futaie,,,257,3.830178,46.932115
2020-796305,2020-07-31,000001,Vente,14000,,,LES GRANDS BOIS,B101,58360,58219,Préporché,58,,,58219000YC0075,,,,,,,,,,,,,0,,,,,BS,taillis sous futaie,,,39,3.830288,46.932092
2020-796305,2020-07-31,000001,Vente,14000,,,LES GRANDS BOIS,B101,58360,58219,Préporché,58,,,58219000YC0077,,,,,,,,,,,,,0,,,,,BS,taillis sous futaie,,,1093,3.83051,46.931721
2020-796305,2020-07-31,000001,Vente,14000,,,BOIS DE BOUSSIGNY,B009,58360,58219,Préporché,58,,,58219000ZB0023,,,,,,,,,,,,,0,,,,,BS,taillis sous futaie,,,18140,3.863431,46.95164
2020-797386,2020-09-29,000002,Vente,77000,,,MONTJOUX,B115,58360,58219,Préporché,58,,,58219000ZA0052,,,,,,,,,,,,,0,,,,,BT,taillis simples,,,1560,3.846276,46.96091
2020-797386,2020-09-29,000002,Vente,77000,110,,HAUT DES CHAMPS,B108,58360,58219,Préporché,58,,,58219000ZB0052,,,,,,,,,,,,,0,1,Maison,128,4,S,sols,,,3405,3.847054,46.960883
2020-797474,2020-10-16,000001,Vente,2500,,,BOIS DE MONTJOUX,B014,58360,58219,Préporché,58,,,58219000ZA0011,,,,,,,,,,,,,0,,,,,BT,taillis simples,,,10466,3.858009,46.96824
2020-798048,2020-11-07,000001,Vente,6100,,,VENITIEN HAUT,B180,58360,58219,Préporché,58,,,58219000ZM0090,,,,,,,,,,,,,0,,,,,BT,taillis simples,,,806,3.903328,46.931843
2020-798048,2020-11-07,000001,Vente,6100,183,A,LES SOUHAITS,B166,58360,58219,Préporché,58,,,58219000ZN0012,,,,,,,,,,,,,0,1,Maison,63,3,P,prés,,,12230,3.902639,46.931328
2020-798048,2020-11-07,000001,Vente,6100,183,A,LES SOUHAITS,B166,58360,58219,Préporché,58,,,58219000ZN0012,,,,,,,,,,,,,0,1,Maison,63,3,S,sols,,,1980,3.902639,46.931328
2020-798048,2020-11-07,000001,Vente,6100,,,LES SOUHAITS,B166,58360,58219,Préporché,58,,,58219000ZN0025,,,,,,,,,,,,,0,,,,,P,prés,,,4950,3.904641,46.931763
2020-798048,2020-11-07,000001,Vente,6100,,,LE RASSOUS,B157,58360,58219,Préporché,58,,,58219000ZP0006,,,,,,,,,,,,,0,,,,,P,prés,,,10335,3.896961,46.933578
2020-798048,2020-11-07,000001,Vente,6100,,,LE RASSOUS,B157,58360,58219,Préporché,58,,,58219000ZP0006,,,,,,,,,,,,,0,,,,,P,prés,,,10335,3.896961,46.933578
2020-798054,2020-10-21,000001,Vente,264700,,,LE PRE POURRI,B142,58360,58219,Préporché,58,,,58219000YB0003,,,,,,,,,,,,,0,,,,,P,prés,,,40587,3.809463,46.932397
2020-798054,2020-10-21,000001,Vente,264700,,,LE PRE POURRI,B142,58360,58219,Préporché,58,,,58219000YB0003,,,,,,,,,,,,,0,,,,,P,prés,,,81173,3.809463,46.932397
2020-798054,2020-10-21,000001,Vente,264700,,,LE CHAMP DE LA HALLE,B039,58360,58219,Préporché,58,,,58219000YB0004,,,,,,,,,,,,,0,,,,,T,terres,,,55240,3.812997,46.930961
2020-798054,2020-10-21,000001,Vente,264700,,,BOIS DE MORILLON,B015,58360,58219,Préporché,58,,,58219000YB0032,,,,,,,,,,,,,0,,,,,BS,taillis sous futaie,,,113180,3.815777,46.929567
2020-798054,2020-10-21,000001,Vente,264700,,,MORILLON,B117,58360,58219,Préporché,58,,,58219000YB0051,,,,,,,,,,,,,0,,,,,T,terres,,,1797,3.820039,46.931625
2020-798085,2020-11-05,000001,Vente,50000,,,MORILLON,B117,58360,58219,Préporché,58,,,58219000YB0007,,,,,,,,,,,,,0,,,,,VE,vergers,,,1335,3.817554,46.93212
2020-798085,2020-11-05,000001,Vente,50000,,,MORILLON,B117,58360,58219,Préporché,58,,,58219000YB0008,,,,,,,,,,,,,0,,,,,J,jardins,,,727,3.817878,46.932301
2020-798085,2020-11-05,000001,Vente,50000,59,,MORILLON,B117,58360,58219,Préporché,58,,,58219000YB0011,,,,,,,,,,,,,0,1,Maison,139,5,S,sols,,,1053,3.818018,46.932686
2020-798974,2020-12-30,000001,Vente,120000,9001,,MONTGAUDON,B114,58360,58219,Préporché,58,,,58219000ZS0008,,,,,,,,,,,,,0,1,Maison,120,3,S,sols,,,153,3.868117,46.924251
2020-798974,2020-12-30,000001,Vente,120000,,,LA NEUVELLE,B125,58360,58219,Préporché,58,,,58219000ZS0051,,,,,,,,,,,,,0,,,,,BT,taillis simples,,,837,3.86837,46.924229
2020-798974,2020-12-30,000001,Vente,120000,,,MONTGAUDON,B114,58360,58219,Préporché,58,,,58219000ZS0055,,,,,,,,,,,,,0,,,,,S,sols,,,42,3.868108,46.924304
2020-798974,2020-12-30,000001,Vente,120000,,,MONTGAUDON,B114,58360,58219,Préporché,58,,,58219000ZT0032,,,,,,,,,,,,,0,,,,,P,prés,,,4100,3.867653,46.924697
2020-798974,2020-12-30,000001,Vente,120000,5001,,MONTGAUDON,B114,58360,58219,Préporché,58,,,58219000ZT0033,,,,,,,,,,,,,0,4,Local industriel. commercial ou assimilé,50,0,S,sols,,,95,3.867838,46.924519
