id_mutation,date_mutation,numero_disposition,nature_mutation,valeur_fonciere,adresse_numero,adresse_suffixe,adresse_nom_voie,adresse_code_voie,code_postal,code_commune,nom_commune,code_departement,ancien_code_commune,ancien_nom_commune,id_parcelle,ancien_id_parcelle,numero_volume,lot1_numero,lot1_surface_carrez,lot2_numero,lot2_surface_carrez,lot3_numero,lot3_surface_carrez,lot4_numero,lot4_surface_carrez,lot5_numero,lot5_surface_carrez,nombre_lots,code_type_local,type_local,surface_reelle_bati,nombre_pieces_principales,code_nature_culture,nature_culture,code_nature_culture_speciale,nature_culture_speciale,surface_terrain,longitude,latitude
2020-841465,2020-01-09,000001,Vente,22000,74,,RUE EDGARD LOUBRY,0150,59970,59253,Fresnes-sur-Escaut,59,,,59253000AP0510,,,,,,,,,,,,,0,1,Maison,81,4,S,sols,,,154,3.579525,50.434548
2020-841469,2020-01-10,000001,Vente,55000,235,,RUE EDGARD LOUBRY,0150,59970,59253,Fresnes-sur-Escaut,59,,,59253000AP0350,,,,,,,,,,,,,0,1,Maison,67,4,S,sols,,,249,3.577096,50.434933
2020-841504,2020-01-20,000001,Vente,67000,69,,RUE EMILE ZOLA,0180,59970,59253,Fresnes-sur-Escaut,59,,,59253000AP0540,,,,,,,,,,,,,0,1,Maison,116,5,S,sols,,,356,3.581271,50.435267
2020-841553,2020-01-24,000001,Vente,112000,278,,RUE JACQUES RENARD,0270,59970,59253,Fresnes-sur-Escaut,59,,,59253000AL0040,,,,,,,,,,,,,0,1,Maison,128,6,S,sols,,,765,3.553329,50.443402
2020-841554,2020-01-23,000001,Vente,13000,33,,RUE DES DEPORTES,0376,59970,59253,Fresnes-sur-Escaut,59,,,59253000AN0148,,,,,,,,,,,,,0,3,Dépendance,,0,S,sols,,,65,3.562757,50.437489
2020-841710,2020-01-31,000001,Vente,100500,165,,RUE ROGER SALENGRO,0460,59970,59253,Fresnes-sur-Escaut,59,,,59253000AP0218,,,,,,,,,,,,,0,1,Maison,100,5,S,sols,,,168,3.577536,50.433426
2020-841710,2020-01-31,000001,Vente,100500,,,RUE ROGER SALENGRO,0460,59970,59253,Fresnes-sur-Escaut,59,,,59253000AP1026,,,,,,,,,,,,,0,,,,,J,jardins,,,249,3.577269,50.433493
2020-841710,2020-01-31,000001,Vente,100500,,,RUE ROGER SALENGRO,0460,59970,59253,Fresnes-sur-Escaut,59,,,59253000AP1032,,,,,,,,,,,,,0,,,,,S,sols,,,48,3.577377,50.433606
2020-841746,2020-02-05,000001,Vente,100000,29,B,RUE PASTEUR,0400,59970,59253,Fresnes-sur-Escaut,59,,,59253000AP0078,,,,,,,,,,,,,0,1,Maison,55,2,S,sols,,,272,3.573559,50.431689
2020-841771,2020-02-04,000001,Vente,40000,174,,RUE VICTOR HUGO,0560,59970,59253,Fresnes-sur-Escaut,59,,,59253000AN0611,,,,,,,,,,,,,0,1,Maison,80,3,S,sols,,,99,3.563095,50.437448
2020-841771,2020-02-04,000001,Vente,40000,174,,RUE VICTOR HUGO,0560,59970,59253,Fresnes-sur-Escaut,59,,,59253000AN0611,,,,,,,,,,,,,0,1,Maison,70,3,S,sols,,,99,3.563095,50.437448
2020-841771,2020-02-04,000001,Vente,40000,,,RUE VICTOR HUGO,0560,59970,59253,Fresnes-sur-Escaut,59,,,59253000AN0612,,2,,,,,,,,,,,0,,,,,,,,,,3.563151,50.437408
2020-841814,2020-02-12,000001,Vente,127359.57,52,,RUE MARCEL CACHIN,0355,59970,59253,Fresnes-sur-Escaut,59,,,59253000AW0395,,,,,,,,,,,,,0,1,Maison,86,5,S,sols,,,223,3.561143,50.434662
2020-841814,2020-02-12,000001,Vente,127359.57,,,CHAMP DE LA HAUTE BORNE,B004,59970,59253,Fresnes-sur-Escaut,59,,,59253000AW0593,,,,,,,,,,,,,0,,,,,AG,terrains d'agrément,,,191,3.561383,50.434746
2020-841836,2020-01-24,000001,Vente,80000,16,,RUE JEAN JAURES,0280,59970,59253,Fresnes-sur-Escaut,59,,,59253000AP0136,,,,,,,,,,,,,0,4,Local industriel. commercial ou assimilé,66,0,S,sols,,,78,3.57778,50.432963
2020-841836,2020-01-24,000001,Vente,80000,134,,RUE ROGER SALENGRO,0460,59970,59253,Fresnes-sur-Escaut,59,,,59253000AP0986,,,,,,,,,,,,,0,3,Dépendance,,0,S,sols,,,21,3.577471,50.433027
2020-841878,2020-01-21,000002,Vente,3000,,,RUE DE LA MARINE,0370,59970,59253,Fresnes-sur-Escaut,59,,,59253000AT0257,,,,,,,,,,,,,0,,,,,J,jardins,,,39,3.574706,50.430528
2020-841995,2020-02-26,000001,Vente,35000,84,,RUE ETIENNE BANCEL,0200,59970,59253,Fresnes-sur-Escaut,59,,,59253000AO0672,,,,,,,,,,,,,0,1,Maison,91,4,S,sols,,,156,3.573036,50.434177
2020-842038,2020-02-10,000001,Vente,58000,30,,RUE DE LA MARINE,0370,59970,59253,Fresnes-sur-Escaut,59,,,59253000AT0086,,,,,,,,,,,,,0,1,Maison,84,4,S,sols,,,122,3.575126,50.430321
2020-842094,2020-02-21,000002,Vente,76000,64,,RUE DE LA PAIX,0398,59970,59253,Fresnes-sur-Escaut,59,,,59253000AR0471,,,,,,,,,,,,,0,1,Maison,61,3,S,sols,,,253,3.578653,50.431073
2020-842226,2020-02-12,000001,Vente,159000,2,,RUE LOUIS ARAGON,0335,59970,59253,Fresnes-sur-Escaut,59,,,59253000AL0199,,,,,,,,,,,,,0,1,Maison,78,4,S,sols,,,365,3.558308,50.446756
2020-842234,2020-02-19,000001,Vente,2500,,,LES CHAMPS DU MOULIN,B008,59970,59253,Fresnes-sur-Escaut,59,,,59253000AH0142,,,,,,,,,,,,,0,,,,,J,jardins,,,4222,3.579938,50.437206
2020-842238,2020-02-27,000001,Vente,110000,,,PL HENRI BARBUSSE,0240,59970,59253,Fresnes-sur-Escaut,59,,,59253000AN0101,,,,,,,,,,,,,0,,,,,S,sols,,,270,3.559754,50.43752
2020-842238,2020-02-27,000001,Vente,110000,41,,PL HENRI BARBUSSE,0240,59970,59253,Fresnes-sur-Escaut,59,,,59253000AN0105,,,,,,,,,,,,,0,1,Maison,43,1,S,sols,,,482,3.559938,50.437528
2020-842405,2020-02-04,000001,Vente,94500,2,,RUE MARCEL CACHIN,0355,59970,59253,Fresnes-sur-Escaut,59,,,59253000AW0295,,,,,,,,,,,,,0,1,Maison,84,5,S,sols,,,279,3.563071,50.43278
2020-842412,2020-03-09,000001,Vente,135000,1,,RUE EMILE ZOLA,0180,59970,59253,Fresnes-sur-Escaut,59,,,59253000AP0158,,,,,,,,,,,,,0,2,Appartement,125,5,S,sols,,,108,3.579019,50.433531
2020-842412,2020-03-09,000001,Vente,135000,1,,RUE EMILE ZOLA,0180,59970,59253,Fresnes-sur-Escaut,59,,,59253000AP0158,,,,,,,,,,,,,0,4,Local industriel. commercial ou assimilé,70,0,S,sols,,,108,3.579019,50.433531
2020-842442,2020-03-02,000001,Vente,40000,66,,RUE JEAN JAURES,0280,59970,59253,Fresnes-sur-Escaut,59,,,59253000AP0114,,,,,,,,,,,,,0,4,Local industriel. commercial ou assimilé,100,0,S,sols,,,178,3.576171,50.432317
2020-842442,2020-03-02,000001,Vente,40000,66,,RUE JEAN JAURES,0280,59970,59253,Fresnes-sur-Escaut,59,,,59253000AP0114,,,,,,,,,,,,,0,2,Appartement,97,5,S,sols,,,178,3.576171,50.432317
2020-842442,2020-03-02,000001,Vente,40000,66,,RUE JEAN JAURES,0280,59970,59253,Fresnes-sur-Escaut,59,,,59253000AP0114,,,,,,,,,,,,,0,1,Maison,53,2,S,sols,,,178,3.576171,50.432317
2020-842491,2020-02-25,000001,Vente,103000,12,,PL HENRI DURRE,0250,59970,59253,Fresnes-sur-Escaut,59,,,59253000AW0655,,,,,,,,,,,,,0,1,Maison,93,4,S,sols,,,353,3.557362,50.434837
2020-842778,2020-04-16,000001,Vente,130000,27,,RUE DE LA GARE,0220,59970,59253,Fresnes-sur-Escaut,59,,,59253000AP0035,,,,,,,,,,,,,0,4,Local industriel. commercial ou assimilé,401,0,S,sols,,,520,3.573285,50.432657
2020-842778,2020-04-16,000001,Vente,130000,25,B,RUE DE LA GARE,0220,59970,59253,Fresnes-sur-Escaut,59,,,59253000AP0037,,,,,,,,,,,,,0,4,Local industriel. commercial ou assimilé,355,0,S,sols,,,528,3.573472,50.432747
2020-842778,2020-04-16,000001,Vente,130000,25,,RUE DE LA GARE,0220,59970,59253,Fresnes-sur-Escaut,59,,,59253000AP0866,,,,,,,,,,,,,0,4,Local industriel. commercial ou assimilé,157,0,S,sols,,,609,3.573658,50.432814
2020-842806,2020-05-13,000001,Vente,122000,,,RUE VICTOR HUGO,0560,59970,59253,Fresnes-sur-Escaut,59,,,59253000AN0257,,,,,,,,,,,,,0,,,,,J,jardins,,,1208,3.562766,50.436628
2020-842806,2020-05-13,000001,Vente,122000,243,,RUE VICTOR HUGO,0560,59970,59253,Fresnes-sur-Escaut,59,,,59253000AN0258,,,,,,,,,,,,,0,1,Maison,130,5,S,sols,,,148,3.562427,50.436907
2020-842806,2020-05-13,000001,Vente,122000,,,RUE VICTOR HUGO,0560,59970,59253,Fresnes-sur-Escaut,59,,,59253000AN0261,,,,,,,,,,,,,0,,,,,S,sols,,,112,3.562395,50.436816
2020-842806,2020-05-13,000001,Vente,122000,,,RUE VICTOR HUGO,0560,59970,59253,Fresnes-sur-Escaut,59,,,59253000AN0515,,,,,,,,,,,,,0,,,,,J,jardins,,,419,3.563229,50.436407
2020-842811,2020-05-12,000001,Vente,90000,589,,RUE EDGARD LOUBRY,0150,59970,59253,Fresnes-sur-Escaut,59,,,59253000AO0360,,,,,,,,,,,,,0,1,Maison,65,4,S,sols,,,307,3.573331,50.437019
2020-842833,2020-05-13,000001,Vente,33200,11,,RUE JULES BEAULIEUE,0310,59970,59253,Fresnes-sur-Escaut,59,,,59253000AK0150,,,,,,,,,,,,,0,1,Maison,85,3,S,sols,,,765,3.559386,50.44742
2020-842833,2020-05-13,000001,Vente,33200,,,RUE JULES BEAULIEUE,0310,59970,59253,Fresnes-sur-Escaut,59,,,59253000AK0153,,,,,,,,,,,,,0,,,,,S,sols,,,14,3.55943,50.447353
2020-842834,2020-05-14,000001,Vente,77500,69,,RUE JACQUES RENARD,0270,59970,59253,Fresnes-sur-Escaut,59,,,59253000AX0311,,,,,,,,,,,,,0,1,Maison,116,4,S,sols,,,87,3.555884,50.438004
2020-842834,2020-05-14,000001,Vente,77500,,,RUE JACQUES RENARD,0270,59970,59253,Fresnes-sur-Escaut,59,,,59253000AX0319,,,,,,,,,,,,,0,,,,,S,sols,,,450,3.555946,50.43785
2020-842834,2020-05-14,000001,Vente,77500,69,,RUE JACQUES RENARD,0270,59970,59253,Fresnes-sur-Escaut,59,,,59253000AX0320,,,,,,,,,,,,,0,3,Dépendance,,0,S,sols,,,58,3.556026,50.437871
2020-842834,2020-05-14,000001,Vente,77500,69,,RUE JACQUES RENARD,0270,59970,59253,Fresnes-sur-Escaut,59,,,59253000AX0320,,,,,,,,,,,,,0,3,Dépendance,,0,S,sols,,,58,3.556026,50.437871
2020-842877,2020-05-19,000002,Vente,130000,67,,RUE DES CORDIERS,0105,59970,59253,Fresnes-sur-Escaut,59,,,59253000AN0618,,,,,,,,,,,,,0,1,Maison,87,5,,,,,,3.567091,50.440129
2020-843036,2020-05-26,000001,Vente,70000,338,,RUE EMILE TABARY,0170,59970,59253,Fresnes-sur-Escaut,59,,,59253000AO0165,,,,,,,,,,,,,0,1,Maison,74,3,S,sols,,,225,3.569051,50.432984
2020-843056,2020-05-22,000001,Vente,135000,8,,RUE DU CHEMIN VERT,0075,59970,59253,Fresnes-sur-Escaut,59,,,59253000AM0518,,,,,,,,,,,,,0,1,Maison,73,4,S,sols,,,286,3.562911,50.443065
2020-843078,2020-05-19,000001,Vente,250000,203,,RUE JEAN JAURES,0280,59970,59253,Fresnes-sur-Escaut,59,,,59253000AT0034,,,,,,,,,,,,,0,1,Maison,203,7,S,sols,,,1362,3.571513,50.429339
2020-843078,2020-05-19,000001,Vente,250000,,,LA VILLE OUEST,B035,59970,59253,Fresnes-sur-Escaut,59,,,59253000AT0035,,,,,,,,,,,,,0,,,,,AG,terrains d'agrément,,,1990,3.571898,50.42896
2020-843306,2020-05-13,000001,Vente,80000,65,B,RUE EMILE ZOLA,0180,59970,59253,Fresnes-sur-Escaut,59,,,59253000AP0537,,,,,,,,,,,,,0,,,,,S,sols,,,70,3.581223,50.43502
2020-843306,2020-05-13,000001,Vente,80000,65,,RUE EMILE ZOLA,0180,59970,59253,Fresnes-sur-Escaut,59,,,59253000AP1023,,,,,,,,,,,,,0,1,Maison,105,4,S,sols,,,426,3.581115,50.435169
2020-843306,2020-05-13,000001,Vente,80000,,,RUE EMILE ZOLA,0180,59970,59253,Fresnes-sur-Escaut,59,,,59253000AP1024,,,,,,,,,,,,,0,,,,,S,sols,,,175,3.580976,50.43516
2020-843328,2020-05-18,000001,Vente,35000,5,,RUE JEAN JAURES,0280,59970,59253,Fresnes-sur-Escaut,59,,,59253000AP0685,,,,,,,,,,,,,0,2,Appartement,70,4,S,sols,,,142,3.57847,50.432776
2020-843328,2020-05-18,000001,Vente,35000,5,,RUE JEAN JAURES,0280,59970,59253,Fresnes-sur-Escaut,59,,,59253000AP0685,,,,,,,,,,,,,0,2,Appartement,58,2,S,sols,,,142,3.57847,50.432776
2020-843386,2020-06-11,000001,Vente,68000,24,,AV DU HUIT MAI 1945,0260,59970,59253,Fresnes-sur-Escaut,59,,,59253000AO0445,,,,,,,,,,,,,0,1,Maison,71,4,S,sols,,,239,3.570001,50.434103
2020-843505,2020-05-29,000001,Vente,107000,125,,RUE ROGER SALENGRO,0460,59970,59253,Fresnes-sur-Escaut,59,,,59253000AP0227,,,,,,,,,,,,,0,1,Maison,94,3,S,sols,,,245,3.577002,50.433194
2020-843599,2020-06-29,000001,Vente,47000,52,,RUE EMILE ZOLA,0180,59970,59253,Fresnes-sur-Escaut,59,,,59253000AP0578,,,,,,,,,,,,,0,1,Maison,80,5,S,sols,,,228,3.580952,50.434143
2020-843599,2020-06-29,000001,Vente,47000,,,LA VILLE,B034,59970,59253,Fresnes-sur-Escaut,59,,,59253000AP0605,,,,,,,,,,,,,0,,,,,J,jardins,,,532,3.581661,50.433968
2020-843686,2020-07-02,000001,Vente,190000,323,,RUE JACQUES PREVERT,0262,59970,59253,Fresnes-sur-Escaut,59,,,59253000AV0014,,,,,,,,,,,,,0,1,Maison,156,9,S,sols,,,512,3.563288,50.430266
2020-843686,2020-07-02,000001,Vente,190000,,,RUE JACQUES PREVERT,0262,59970,59253,Fresnes-sur-Escaut,59,,,59253000AV0015,,,,,,,,,,,,,0,,,,,J,jardins,,,1105,3.563723,50.429937
2020-843747,2020-06-30,000001,Vente,99400,817,,RUE LEON GAMBETTA,0331,59970,59253,Fresnes-sur-Escaut,59,,,59253000AM0223,,,,,,,,,,,,,0,1,Maison,62,4,S,sols,,,553,3.555837,50.442001
2020-843762,2020-06-12,000001,Vente,106900,2069,,RUE EDGARD LOUBRY,0150,59970,59253,Fresnes-sur-Escaut,59,,,59253000AL0318,,,,,,,,,,,,,0,1,Maison,92,3,S,sols,,,505,3.557777,50.445815
2020-843789,2020-06-12,000001,Vente,26000,37,,RUE JEAN JAURES,0280,59970,59253,Fresnes-sur-Escaut,59,,,59253000AP0716,,,,,,,,,,,,,0,1,Maison,89,6,S,sols,,,241,3.577484,50.432308
2020-843789,2020-06-12,000001,Vente,26000,37,,RUE JEAN JAURES,0280,59970,59253,Fresnes-sur-Escaut,59,,,59253000AP0716,,,,,,,,,,,,,0,4,Local industriel. commercial ou assimilé,53,0,S,sols,,,241,3.577484,50.432308
2020-843805,2020-06-29,000001,Vente,62000,68,,RUE MOLIERE,0385,59970,59253,Fresnes-sur-Escaut,59,,,59253000AR0219,,,,,,,,,,,,,0,1,Maison,73,4,S,sols,,,392,3.584411,50.432968
2020-843873,2020-07-17,000001,Vente,61000,10,,RUE JEAN JAURES,0280,59970,59253,Fresnes-sur-Escaut,59,,,59253000AP0139,,,,,,,,,,,,,0,4,Local industriel. commercial ou assimilé,53,0,S,sols,,,220,3.577887,50.43312
2020-843873,2020-07-17,000001,Vente,61000,10,,RUE JEAN JAURES,0280,59970,59253,Fresnes-sur-Escaut,59,,,59253000AP0139,,,,,,,,,,,,,0,2,Appartement,26,2,S,sols,,,220,3.577887,50.43312
2020-843873,2020-07-17,000001,Vente,61000,10,,RUE JEAN JAURES,0280,59970,59253,Fresnes-sur-Escaut,59,,,59253000AP0139,,,,,,,,,,,,,0,2,Appartement,36,2,S,sols,,,220,3.577887,50.43312
2020-843874,2020-07-10,000001,Vente,80000,68,,RUE EMILE ZOLA,0180,59970,59253,Fresnes-sur-Escaut,59,,,59253000AP1002,,,,,,,,,,,,,0,1,Maison,90,4,S,sols,,,668,3.581569,50.434403
2020-843880,2020-06-25,000001,Vente,14000,64,,RUE DES DEPORTES,0376,59970,59253,Fresnes-sur-Escaut,59,,,59253000AN0196,,,,,,,,,,,,,0,3,Dépendance,,0,S,sols,,,94,3.563081,50.437764
2020-843880,2020-06-25,000001,Vente,14000,64,,RUE DES DEPORTES,0376,59970,59253,Fresnes-sur-Escaut,59,,,59253000AN0196,,,,,,,,,,,,,0,3,Dépendance,,0,S,sols,,,94,3.563081,50.437764
2020-843940,2020-07-08,000001,Vente,66000,49,,RUE MOLIERE,0385,59970,59253,Fresnes-sur-Escaut,59,,,59253000AR0228,,,,,,,,,,,,,0,1,Maison,73,4,S,sols,,,390,3.584987,50.433586
2020-844013,2020-07-21,000001,Vente,105000,1106,,RUE EMILE TABARY,0170,59970,59253,Fresnes-sur-Escaut,59,,,59253000AW0261,,,,,,,,,,,,,0,1,Maison,110,4,S,sols,,,703,3.558591,50.431292
2020-844129,2020-07-16,000001,Vente,39000,21,,PL VAILLANT COUTURIER,0410,59970,59253,Fresnes-sur-Escaut,59,,,59253000AP0691,,,,,,,,,,,,,0,1,Maison,81,3,S,sols,,,108,3.578736,50.432658
2020-844185,2020-07-28,000001,Vente,60000,48,,RUE CARNOT,0060,59970,59253,Fresnes-sur-Escaut,59,,,59253000AP0480,,,,,,,,,,,,,0,1,Maison,130,8,S,sols,,,200,3.580458,50.435867
2020-844236,2020-07-30,000001,Vente,68000,10,,RUE MOLIERE,0385,59970,59253,Fresnes-sur-Escaut,59,,,59253000AR0167,,,,,,,,,,,,,0,1,Maison,72,4,S,sols,,,396,3.583874,50.43299
2020-844457,2020-08-31,000001,Vente,96000,32,,RUE DE LA LIBERTE,0330,59970,59253,Fresnes-sur-Escaut,59,,,59253000AX0086,,,,,,,,,,,,,0,1,Maison,99,4,S,sols,,,474,3.554195,50.440758
2020-844457,2020-08-31,000001,Vente,96000,,,RUE DE LA LIBERTE,0330,59970,59253,Fresnes-sur-Escaut,59,,,59253000AX0458,,,,,,,,,,,,,0,,,,,S,sols,,,13,3.554117,50.440889
2020-844457,2020-08-31,000001,Vente,96000,,,RUE DE LA LIBERTE,0330,59970,59253,Fresnes-sur-Escaut,59,,,59253000AX0568,,,,,,,,,,,,,0,,,,,S,sols,,,61,3.554374,50.440755
2020-844583,2020-09-04,000001,Vente,65000,,,RUE VICTOR HUGO,0560,59970,59253,Fresnes-sur-Escaut,59,,,59253000AN0231,,,,,,,,,,,,,0,,,,,J,jardins,,,572,3.564628,50.437278
2020-844583,2020-09-04,000001,Vente,65000,95,,RUE VICTOR HUGO,0560,59970,59253,Fresnes-sur-Escaut,59,,,59253000AN0232,,,,,,,,,,,,,0,1,Maison,70,5,S,sols,,,138,3.564353,50.437523
2020-844639,2020-08-21,000001,Vente,140500,268,,RUE EMILE ZOLA,0180,59970,59253,Fresnes-sur-Escaut,59,,,59253000AD0047,,,,,,,,,,,,,0,1,Maison,86,5,S,sols,,,486,3.588105,50.443512
2020-844750,2020-09-15,000002,Vente,112000,200,,RUE JACQUES RENARD,0270,59970,59253,Fresnes-sur-Escaut,59,,,59253000AX0695,,,,,,,,,,,,,0,,,,,S,sols,,,140,3.551622,50.441006
2020-844815,2020-09-23,000001,Vente,55000,10,,RUE ZAMENHOFF,0570,59970,59253,Fresnes-sur-Escaut,59,,,59253000AP0698,,,,,,,,,,,,,0,1,Maison,79,4,S,sols,,,231,3.578676,50.432408
2020-844855,2020-09-25,000001,Vente,38000,56,,RUE ETIENNE BANCEL,0200,59970,59253,Fresnes-sur-Escaut,59,,,59253000AP0285,,,,,,,,,,,,,0,1,Maison,135,6,S,sols,,,636,3.574485,50.433654
2020-845141,2020-10-08,000001,Vente,85000,,,RUE PASTEUR,0400,59970,59253,Fresnes-sur-Escaut,59,,,59253000AV0065,,,,,,,,,,,,,0,,,,,J,jardins,,,1071,3.572381,50.432117
2020-845141,2020-10-08,000001,Vente,85000,48,,RUE PASTEUR,0400,59970,59253,Fresnes-sur-Escaut,59,,,59253000AV0321,,,,,,,,,,,,,0,1,Maison,81,4,S,sols,,,216,3.572922,50.431751
2020-845244,2020-09-18,000001,Vente,30000,156,,RUE EDGARD LOUBRY,0150,59970,59253,Fresnes-sur-Escaut,59,,,59253000AP0359,,,,,,,,,,,,,0,1,Maison,95,6,S,sols,,,114,3.578405,50.434965
2020-845244,2020-09-18,000001,Vente,30000,156,,RUE EDGARD LOUBRY,0150,59970,59253,Fresnes-sur-Escaut,59,,,59253000AP0359,,,,,,,,,,,,,0,4,Local industriel. commercial ou assimilé,37,0,S,sols,,,114,3.578405,50.434965
2020-845302,2020-10-09,000001,Vente,76500,154,,RUE JEAN JAURES,0280,59970,59253,Fresnes-sur-Escaut,59,,,59253000AV0282,,,,,,,,,,,,,0,1,Maison,124,3,S,sols,,,457,3.572694,50.430481
2020-845363,2020-09-22,000001,Vente,87500,38,,RUE JACQUES RENARD,0270,59970,59253,Fresnes-sur-Escaut,59,,,59253000AX0228,,,,,,,,,,,,,0,1,Maison,54,3,S,sols,,,534,,
2020-845363,2020-09-22,000001,Vente,87500,38,,RUE JACQUES RENARD,0270,59970,59253,Fresnes-sur-Escaut,59,,,59253000AX0228,,,,,,,,,,,,,0,1,Maison,36,2,S,sols,,,534,,
2020-845363,2020-09-22,000001,Vente,87500,38,,RUE JACQUES RENARD,0270,59970,59253,Fresnes-sur-Escaut,59,,,59253000AX0228,,,,,,,,,,,,,0,1,Maison,36,2,S,sols,,,534,,
2020-845363,2020-09-22,000001,Vente,87500,,,RUE JACQUES RENARD,0270,59970,59253,Fresnes-sur-Escaut,59,,,59253000AX0229,,,,,,,,,,,,,0,,,,,J,jardins,,,1635,,
2020-845364,2020-09-22,000001,Vente,115000,,,RUE JACQUES RENARD,0270,59970,59253,Fresnes-sur-Escaut,59,,,59253000AX0129,,,,,,,,,,,,,0,,,,,S,sols,,,390,3.554313,50.439541
2020-845364,2020-09-22,000001,Vente,115000,,,RUE JACQUES RENARD,0270,59970,59253,Fresnes-sur-Escaut,59,,,59253000AX0130,,,,,,,,,,,,,0,,,,,J,jardins,,,748,3.554509,50.43959
2020-845364,2020-09-22,000001,Vente,115000,134,,RUE JACQUES RENARD,0270,59970,59253,Fresnes-sur-Escaut,59,,,59253000AX0131,,,,,,,,,,,,,0,1,Maison,118,5,S,sols,,,213,3.554174,50.439321
2020-845388,2020-10-05,000001,Vente,187100,843,,RUE EMILE TABARY,0170,59970,59253,Fresnes-sur-Escaut,59,,,59253000AW0484,,,,,,,,,,,,,0,1,Maison,87,4,S,sols,,,608,3.562055,50.432052
2020-845388,2020-10-05,000001,Vente,187100,843,,RUE EMILE TABARY,0170,59970,59253,Fresnes-sur-Escaut,59,,,59253000AW0485,,,,,,,,,,,,,0,,,,,S,sols,,,367,3.562184,50.432105
2020-845411,2020-09-30,000001,Vente,180000,1581,,RUE EDGARD LOUBRY,0150,59970,59253,Fresnes-sur-Escaut,59,,,59253000AM0507,,,,,,,,,,,,,0,,,,,T,terres,,,102,3.563104,50.443191
2020-845411,2020-09-30,000001,Vente,180000,1581,,RUE EDGARD LOUBRY,0150,59970,59253,Fresnes-sur-Escaut,59,,,59253000AM0527,,,,,,,,,,,,,0,1,Maison,118,6,S,sols,,,441,3.563681,50.443556
2020-845411,2020-09-30,000001,Vente,180000,1581,,RUE EDGARD LOUBRY,0150,59970,59253,Fresnes-sur-Escaut,59,,,59253000AM0528,,,,,,,,,,,,,0,,,,,AG,terrains d'agrément,,,584,3.563626,50.443467
2020-845446,2020-10-05,000001,Vente,26000,28,,RUE EMILE ZOLA,0180,59970,59253,Fresnes-sur-Escaut,59,,,59253000AP0590,,,,,,,,,,,,,0,1,Maison,52,2,S,sols,,,36,3.580498,50.433985
2020-845469,2020-10-07,000001,Vente,80000,,,RUE JEAN JAURES,0280,59970,59253,Fresnes-sur-Escaut,59,,,59253000AT0177,,,,,,,,,,,,,0,,,,,L,landes,MARAI,Pré marais,1334,3.568888,50.427358
2020-845469,2020-10-07,000001,Vente,80000,221,,RUE JEAN JAURES,0280,59970,59253,Fresnes-sur-Escaut,59,,,59253000AT0181,,,,,,,,,,,,,0,4,Local industriel. commercial ou assimilé,670,0,S,sols,,,2093,3.569191,50.427706
2020-845494,2020-10-15,000001,Vente,70000,273,,RUE JEAN JAURES,0280,59970,59253,Fresnes-sur-Escaut,59,,,59253000AT0007,,,,,,,,,,,,,0,1,Maison,145,7,S,sols,,,180,3.566452,50.425946
2020-845501,2020-10-16,000001,Vente,100000,206,,RUE JULES GUESDE,0320,59970,59253,Fresnes-sur-Escaut,59,,,59253000AO0408,,,,,,,,,,,,,0,1,Maison,79,5,S,sols,,,948,3.569872,50.437222
2020-845566,2020-10-07,000001,Vente,150000,38,,RUE JEAN JAURES,0280,59970,59253,Fresnes-sur-Escaut,59,,,59253000AP0964,,,,,,,,,,,,,0,2,Appartement,39,2,S,sols,,,160,3.577055,50.432672
2020-845566,2020-10-07,000001,Vente,150000,38,,RUE JEAN JAURES,0280,59970,59253,Fresnes-sur-Escaut,59,,,59253000AP0964,,,,,,,,,,,,,0,2,Appartement,108,4,S,sols,,,160,3.577055,50.432672
2020-845566,2020-10-07,000001,Vente,150000,38,,RUE JEAN JAURES,0280,59970,59253,Fresnes-sur-Escaut,59,,,59253000AP0964,,,,,,,,,,,,,0,4,Local industriel. commercial ou assimilé,42,0,S,sols,,,160,3.577055,50.432672
2020-845568,2020-10-29,000001,Vente,57000,116,,RUE JEAN JAURES,0280,59970,59253,Fresnes-sur-Escaut,59,,,59253000AP0085,,,,,,,,,,,,,0,1,Maison,84,4,S,sols,,,218,3.574098,50.431358
2020-845677,2020-11-04,000001,Vente,143000,1137,,RUE EMILE TABARY,0170,59970,59253,Fresnes-sur-Escaut,59,,,59253000AW0178,,,,,,,,,,,,,0,1,Maison,65,6,S,sols,,,920,3.558854,50.430646
2020-845689,2020-10-16,000001,Vente,110000,,,RUE BENOIT MONTFROY,0040,59970,59253,Fresnes-sur-Escaut,59,,,59253000AN0294,,,,,,,,,,,,,0,,,,,J,jardins,,,918,3.56566,50.436821
2020-845689,2020-10-16,000001,Vente,110000,285,,RUE BENOIT MONTFROY,0040,59970,59253,Fresnes-sur-Escaut,59,,,59253000AN0295,,,,,,,,,,,,,0,1,Maison,80,5,S,sols,,,304,3.566449,50.437265
2020-845764,2020-10-20,000001,Vente,198000,518,,RUE EDGARD LOUBRY,0150,59970,59253,Fresnes-sur-Escaut,59,,,59253000AH0300,,,,,,,,,,,,,0,1,Maison,104,4,S,sols,,,894,3.57463,50.437083
2020-845797,2020-11-10,000001,Vente,82000,113,,RUE DR GUERY,0130,59970,59253,Fresnes-sur-Escaut,59,,,59253000AO0204,,,,,,,,,,,,,0,1,Maison,78,4,S,sols,,,130,3.573584,50.435063
2020-845845,2020-11-13,000001,Vente,61000,,,RUE JACQUES RENARD,0270,59970,59253,Fresnes-sur-Escaut,59,,,59253000AN0044,,,,,,,,,,,,,0,,,,,J,jardins,,,52,3.558539,50.437622
2020-845845,2020-11-13,000001,Vente,61000,24,,PL HENRI BARBUSSE,0240,59970,59253,Fresnes-sur-Escaut,59,,,59253000AN0059,,,,,,,,,,,,,0,1,Maison,70,3,S,sols,,,58,3.558683,50.437611
2020-845860,2020-10-23,000001,Vente,176600,38,,RUE LEON GAMBETTA,0331,59970,59253,Fresnes-sur-Escaut,59,,,59253000AN0484,,,,,,,,,,,,,0,1,Maison,94,5,S,sols,,,910,3.565245,50.438441
2020-845880,2020-10-30,000001,Vente,6000,156,,RUE ROGER SALENGRO,0460,59970,59253,Fresnes-sur-Escaut,59,,,59253000AP1134,,,,,,,,,,,,,0,3,Dépendance,,0,S,sols,,,23,3.577722,50.433148
2020-845898,2020-10-23,000001,Vente,55000,138,,RUE JACQUES RENARD,0270,59970,59253,Fresnes-sur-Escaut,59,,,59253000AX0126,,,,,,,,,,,,,0,1,Maison,62,3,S,sols,,,328,3.554085,50.439505
2020-845898,2020-10-23,000001,Vente,55000,,,RUE JACQUES RENARD,0270,59970,59253,Fresnes-sur-Escaut,59,,,59253000AX0127,,,,,,,,,,,,,0,,,,,J,jardins,,,596,3.55434,50.439708
2020-845921,2020-10-30,000001,Vente,126000,157,,RUE BENOIT MONTFROY,0040,59970,59253,Fresnes-sur-Escaut,59,,,59253000AO0024,,,,,,,,,,,,,0,1,Maison,85,3,S,sols,,,205,3.567881,50.436609
2020-845975,2020-10-29,000001,Vente,161185,14,,CHAMP DU MOULIN,0394,59970,59253,Fresnes-sur-Escaut,59,,,59253000AH0495,,,,,,,,,,,,,0,1,Maison,146,4,S,sols,,,539,3.574166,50.438622
2020-846065,2020-10-28,000002,Echange,7500,,,LA NEUVILLE NORD,B025,59970,59253,Fresnes-sur-Escaut,59,,,592530000C0207,,,,,,,,,,,,,0,,,,,PA,pâtures,PATUR,Pâture plantée,6120,3.592425,50.43132
2020-846065,2020-10-28,000002,Echange,7500,,,LA NEUVILLE NORD,B025,59970,59253,Fresnes-sur-Escaut,59,,,592530000C0209,,,,,,,,,,,,,0,,,,,PA,pâtures,PATUR,Pâture plantée,4620,3.591177,50.430433
2020-846139,2020-11-03,000001,Vente,34000,18,,RUE ZAMENHOFF,0570,59970,59253,Fresnes-sur-Escaut,59,,,59253000AP0703,,,,,,,,,,,,,0,1,Maison,88,5,S,sols,,,192,3.578478,50.432236
2020-846165,2020-12-02,000001,Vente,40000,91,,RUE EMILE ZOLA,0180,59970,59253,Fresnes-sur-Escaut,59,,,59253000AP0550,,,,,,,,,,,,,0,1,Maison,93,6,S,sols,,,194,3.581803,50.435697