id_mutation,date_mutation,numero_disposition,nature_mutation,valeur_fonciere,adresse_numero,adresse_suffixe,adresse_nom_voie,adresse_code_voie,code_postal,code_commune,nom_commune,code_departement,ancien_code_commune,ancien_nom_commune,id_parcelle,ancien_id_parcelle,numero_volume,lot1_numero,lot1_surface_carrez,lot2_numero,lot2_surface_carrez,lot3_numero,lot3_surface_carrez,lot4_numero,lot4_surface_carrez,lot5_numero,lot5_surface_carrez,nombre_lots,code_type_local,type_local,surface_reelle_bati,nombre_pieces_principales,code_nature_culture,nature_culture,code_nature_culture_speciale,nature_culture_speciale,surface_terrain,longitude,latitude
2020-853920,2020-01-17,000001,Vente,100000,78,,RUE DU JEU D ARC,4300,60400,60348,Larbroye,60,,,60348000AC0013,,,,,,,,,,,,,0,1,Maison,108,6,S,sols,,,214,2.963788,49.573622
2020-854510,2020-02-28,000001,Vente,27000,28,,RUE DE NOYON,5800,60400,60348,Larbroye,60,,,60348000AC0058,,,,,,,,,,,,,0,3,Dépendance,,0,S,sols,,,95,2.965375,49.573668
2020-854978,2020-05-22,000001,Vente,87000,24,,RUE DU MONT RENAUD,5390,60400,60348,Larbroye,60,,,60348000AC0083,,,,,,,,,,,,,0,1,Maison,129,5,S,sols,,,576,2.966178,49.572534
2020-855240,2020-07-02,000001,Vente,46500,,,LE VILLAGE,B018,60400,60348,Larbroye,60,,,60348000AC0403,,,,,,,,,,,,,0,,,,,AB,terrains a bâtir,,,938,2.960951,49.570727
2020-856167,2020-09-29,000001,Vente,130000,,,LE BAS DES SABLONS,B001,60400,60348,Larbroye,60,,,60348000AD0191,,,,,,,,,,,,,0,,,,,S,sols,,,67,2.956177,49.571934
2020-856167,2020-09-29,000001,Vente,130000,717,,RUE DE MONTDIDIER,5300,60400,60348,Larbroye,60,,,60348000AD0196,,,,,,,,,,,,,0,1,Maison,176,6,S,sols,,,1200,2.956042,49.572381
2020-856167,2020-09-29,000001,Vente,130000,,,LE BAS DES SABLONS,B001,60400,60348,Larbroye,60,,,60348000AD0201,,,,,,,,,,,,,0,,,,,T,terres,,,1123,2.955817,49.571997
2020-856167,2020-09-29,000001,Vente,130000,,,LE BAS DES SABLONS,B001,60400,60348,Larbroye,60,,,60348000AD0203,,,,,,,,,,,,,0,,,,,T,terres,,,119,2.955739,49.571878
2020-856167,2020-09-29,000001,Vente,130000,,,LE BAS DES SABLONS,B001,60400,60348,Larbroye,60,,,60348000AD0212,,,,,,,,,,,,,0,,,,,AB,terrains a bâtir,,,1002,2.956291,49.57225
2020-861106,2020-11-09,000003,Vente,,13,,RUE BEAUSOLEIL,0750,60400,60348,Larbroye,60,,,60348000AC0344,,,,,,,,,,,,,0,1,Maison,84,4,S,sols,,,1272,,
2020-861106,2020-11-09,000003,Vente,,13,,RUE BEAUSOLEIL,0750,60400,60348,Larbroye,60,,,60348000AC0344,,,,,,,,,,,,,0,1,Maison,84,4,S,sols,,,1272,,
2020-861106,2020-11-09,000003,Vente,,13,,RUE BEAUSOLEIL,0750,60400,60348,Larbroye,60,,,60348000AC0344,,,,,,,,,,,,,0,1,Maison,84,4,S,sols,,,1272,,
2020-861106,2020-11-09,000003,Vente,,13,,RUE BEAUSOLEIL,0750,60400,60348,Larbroye,60,,,60348000AC0344,,,,,,,,,,,,,0,1,Maison,84,4,S,sols,,,1272,,
2020-861106,2020-11-09,000003,Vente,,73,,RUE BEAUSOLEIL,0750,60400,60348,Larbroye,60,,,60348000AC0345,,,,,,,,,,,,,0,1,Maison,85,4,S,sols,,,900,,
2020-861106,2020-11-09,000003,Vente,,73,,RUE BEAUSOLEIL,0750,60400,60348,Larbroye,60,,,60348000AC0345,,,,,,,,,,,,,0,1,Maison,85,4,S,sols,,,900,,
2020-861106,2020-11-09,000003,Vente,,73,,RUE BEAUSOLEIL,0750,60400,60348,Larbroye,60,,,60348000AC0345,,,,,,,,,,,,,0,1,Maison,85,4,S,sols,,,900,,
2020-861106,2020-11-09,000003,Vente,,109,,RUE BEAUSOLEIL,0750,60400,60348,Larbroye,60,,,60348000AC0346,,,,,,,,,,,,,0,1,Maison,86,5,S,sols,,,1813,,
2020-861106,2020-11-09,000003,Vente,,109,,RUE BEAUSOLEIL,0750,60400,60348,Larbroye,60,,,60348000AC0346,,,,,,,,,,,,,0,1,Maison,69,4,S,sols,,,1813,,
2020-861106,2020-11-09,000003,Vente,,109,,RUE BEAUSOLEIL,0750,60400,60348,Larbroye,60,,,60348000AC0346,,,,,,,,,,,,,0,1,Maison,86,5,S,sols,,,1813,,
2020-861106,2020-11-09,000003,Vente,,109,,RUE BEAUSOLEIL,0750,60400,60348,Larbroye,60,,,60348000AC0346,,,,,,,,,,,,,0,1,Maison,86,5,S,sols,,,1813,,
2020-861106,2020-11-09,000003,Vente,,109,,RUE BEAUSOLEIL,0750,60400,60348,Larbroye,60,,,60348000AC0346,,,,,,,,,,,,,0,1,Maison,86,4,S,sols,,,1813,,
2020-861106,2020-11-09,000003,Vente,,109,,RUE BEAUSOLEIL,0750,60400,60348,Larbroye,60,,,60348000AC0346,,,,,,,,,,,,,0,1,Maison,69,4,S,sols,,,1813,,
2020-861106,2020-11-09,000003,Vente,,104,,RUE BEAUSOLEIL,0750,60400,60348,Larbroye,60,,,60348000AC0347,,,,,,,,,,,,,0,1,Maison,84,4,S,sols,,,1994,,
2020-861106,2020-11-09,000003,Vente,,104,,RUE BEAUSOLEIL,0750,60400,60348,Larbroye,60,,,60348000AC0347,,,,,,,,,,,,,0,1,Maison,84,4,S,sols,,,1994,,
2020-861106,2020-11-09,000003,Vente,,104,,RUE BEAUSOLEIL,0750,60400,60348,Larbroye,60,,,60348000AC0347,,,,,,,,,,,,,0,1,Maison,96,4,S,sols,,,1994,,
2020-861106,2020-11-09,000003,Vente,,104,,RUE BEAUSOLEIL,0750,60400,60348,Larbroye,60,,,60348000AC0347,,,,,,,,,,,,,0,1,Maison,96,5,S,sols,,,1994,,
2020-861106,2020-11-09,000003,Vente,,104,,RUE BEAUSOLEIL,0750,60400,60348,Larbroye,60,,,60348000AC0347,,,,,,,,,,,,,0,1,Maison,84,4,S,sols,,,1994,,
2020-861106,2020-11-09,000003,Vente,,104,,RUE BEAUSOLEIL,0750,60400,60348,Larbroye,60,,,60348000AC0347,,,,,,,,,,,,,0,1,Maison,84,4,S,sols,,,1994,,
