id_mutation,date_mutation,numero_disposition,nature_mutation,valeur_fonciere,adresse_numero,adresse_suffixe,adresse_nom_voie,adresse_code_voie,code_postal,code_commune,nom_commune,code_departement,ancien_code_commune,ancien_nom_commune,id_parcelle,ancien_id_parcelle,numero_volume,lot1_numero,lot1_surface_carrez,lot2_numero,lot2_surface_carrez,lot3_numero,lot3_surface_carrez,lot4_numero,lot4_surface_carrez,lot5_numero,lot5_surface_carrez,nombre_lots,code_type_local,type_local,surface_reelle_bati,nombre_pieces_principales,code_nature_culture,nature_culture,code_nature_culture_speciale,nature_culture_speciale,surface_terrain,longitude,latitude
2020-853948,2020-01-16,000001,Vente,270000,,,LA VIEILLE EGLISE,B051,60170,60569,Saint-Crépin-aux-Bois,60,,,605690000E0023,,,,,,,,,,,,,0,,,,,BT,taillis simples,,,2520,2.975849,49.43045
2020-853948,2020-01-16,000001,Vente,270000,,,LA VIEILLE EGLISE,B051,60170,60569,Saint-Crépin-aux-Bois,60,,,605690000E0023,,,,,,,,,,,,,0,,,,,S,sols,,,200,2.975849,49.43045
2020-853948,2020-01-16,000001,Vente,270000,29,,RUE DE RETHONDES,7200,60170,60569,Saint-Crépin-aux-Bois,60,,,605690000E0024,,,,,,,,,,,,,0,1,Maison,140,5,S,sols,,,466,2.975473,49.430688
2020-854137,2020-02-11,000001,Vente,350000,12,,CHE DU JEU D ARC,4300,60170,60569,Saint-Crépin-aux-Bois,60,,,605690000D0254,,,,,,,,,,,,,0,1,Maison,115,5,S,sols,,,1471,2.98157,49.439047
2020-855840,2020-08-26,000001,Vente,240000,8,,RUE DE RETHONDES,7200,60170,60569,Saint-Crépin-aux-Bois,60,,,60569000AB0016,,,,,,,,,,,,,0,1,Maison,107,4,S,sols,,,365,2.978224,49.433106
2020-855840,2020-08-26,000001,Vente,240000,,,LE VILLAGE,B055,60170,60569,Saint-Crépin-aux-Bois,60,,,60569000AB0017,,,,,,,,,,,,,0,,,,,J,jardins,,,587,2.977973,49.433249
2020-855967,2020-09-15,000001,Vente,415000,,,L ENGLEE,B014,60170,60569,Saint-Crépin-aux-Bois,60,,,605690000D0219,,,,,,,,,,,,,0,,,,,BT,taillis simples,,,44,2.982322,49.435904
2020-855967,2020-09-15,000001,Vente,415000,14,,RTE D OFFEMONT,6000,60170,60569,Saint-Crépin-aux-Bois,60,,,605690000D0222,,,,,,,,,,,,,0,1,Maison,204,6,T,terres,,,2295,2.982833,49.435672
2020-855967,2020-09-15,000001,Vente,415000,,,L ENGLEE,B014,60170,60569,Saint-Crépin-aux-Bois,60,,,605690000D0223,,,,,,,,,,,,,0,,,,,T,terres,,,24,2.98227,49.435867
2020-861054,2020-11-26,000001,Vente,855000,15,,RTE D OFFEMONT,6000,60170,60569,Saint-Crépin-aux-Bois,60,,,605690000D0075,,,,,,,,,,,,,0,3,Dépendance,,0,S,sols,,,955,2.982402,49.436259
2020-861054,2020-11-26,000001,Vente,855000,15,,RTE D OFFEMONT,6000,60170,60569,Saint-Crépin-aux-Bois,60,,,605690000D0075,,,,,,,,,,,,,0,1,Maison,200,4,S,sols,,,955,2.982402,49.436259
2020-861054,2020-11-26,000001,Vente,855000,,,LE GRAND JARDIN,B029,60170,60569,Saint-Crépin-aux-Bois,60,,,605690000D0076,,,,,,,,,,,,,0,,,,,S,sols,,,1230,2.982341,49.436547
2020-861054,2020-11-26,000001,Vente,855000,,,LE GRAND JARDIN,B029,60170,60569,Saint-Crépin-aux-Bois,60,,,605690000D0173,,,,,,,,,,,,,0,,,,,AG,terrains d'agrément,,,6846,2.981923,49.436276
2020-861054,2020-11-26,000001,Vente,855000,,,LE GRAND JARDIN,B029,60170,60569,Saint-Crépin-aux-Bois,60,,,605690000D0173,,,,,,,,,,,,,0,,,,,E,eaux,ETANG,Etangs,589,2.981923,49.436276
2020-861233,2020-12-04,000001,Vente,456000,,,LE MOULIN A BLE,B036,60170,60569,Saint-Crépin-aux-Bois,60,,,605690000F0059,,,,,,,,,,,,,0,,,,,AG,terrains d'agrément,,,1185,2.975674,49.435262
2020-861233,2020-12-04,000001,Vente,456000,,,LE MOULIN A BLE,B036,60170,60569,Saint-Crépin-aux-Bois,60,,,605690000F0059,,,,,,,,,,,,,0,,,,,S,sols,,,200,2.975674,49.435262
2020-861233,2020-12-04,000001,Vente,456000,,,LA RUE MADAME,B044,60170,60569,Saint-Crépin-aux-Bois,60,,,605690000F0107,,,,,,,,,,,,,0,,,,,T,terres,,,683,2.974411,49.436125
2020-861233,2020-12-04,000001,Vente,456000,,,LA RUE MADAME,B044,60170,60569,Saint-Crépin-aux-Bois,60,,,605690000F0109,,,,,,,,,,,,,0,,,,,AG,terrains d'agrément,,,2705,2.974998,49.435745
2020-861233,2020-12-04,000001,Vente,456000,4,,RUE MADAME,5020,60170,60569,Saint-Crépin-aux-Bois,60,,,605690000F0115,,,,,,,,,,,,,0,1,Maison,178,5,S,sols,,,1054,2.975398,49.435574
2020-861233,2020-12-04,000001,Vente,456000,,,LA RUE MADAME,B044,60170,60569,Saint-Crépin-aux-Bois,60,,,605690000F0117,,,,,,,,,,,,,0,,,,,S,sols,,,159,2.975601,49.435608
2020-861233,2020-12-04,000001,Vente,456000,,,LA RUE MADAME,B044,60170,60569,Saint-Crépin-aux-Bois,60,,,605690000F0120,,,,,,,,,,,,,0,,,,,BR,futaies résineuses,,,1519,2.975022,49.436156
2020-861233,2020-12-04,000001,Vente,456000,,,LA RUE MADAME,B044,60170,60569,Saint-Crépin-aux-Bois,60,,,605690000F0120,,,,,,,,,,,,,0,,,,,AG,terrains d'agrément,,,480,2.975022,49.436156
2020-861233,2020-12-04,000001,Vente,456000,,,LE MOULIN A BLE,B036,60170,60569,Saint-Crépin-aux-Bois,60,,,605690000F0121,,,,,,,,,,,,,0,,,,,E,eaux,ETANG,Etangs,1431,2.975738,49.435067
2020-861233,2020-12-04,000001,Vente,456000,,,LE MOULIN A BLE,B036,60170,60569,Saint-Crépin-aux-Bois,60,,,605690000F0121,,,,,,,,,,,,,0,,,,,AG,terrains d'agrément,,,1590,2.975738,49.435067
2020-861233,2020-12-04,000001,Vente,456000,,,LE MOULIN A BLE,B036,60170,60569,Saint-Crépin-aux-Bois,60,,,605690000F0173,,,,,,,,,,,,,0,,,,,S,sols,,,77,2.975848,49.435388
2020-861233,2020-12-04,000001,Vente,456000,7,,RUE DU MOULIN,5380,60170,60569,Saint-Crépin-aux-Bois,60,,,605690000F0175,,,,,,,,,,,,,0,,,,,S,sols,,,54,2.975989,49.435277
