id_mutation,date_mutation,numero_disposition,nature_mutation,valeur_fonciere,adresse_numero,adresse_suffixe,adresse_nom_voie,adresse_code_voie,code_postal,code_commune,nom_commune,code_departement,ancien_code_commune,ancien_nom_commune,id_parcelle,ancien_id_parcelle,numero_volume,lot1_numero,lot1_surface_carrez,lot2_numero,lot2_surface_carrez,lot3_numero,lot3_surface_carrez,lot4_numero,lot4_surface_carrez,lot5_numero,lot5_surface_carrez,nombre_lots,code_type_local,type_local,surface_reelle_bati,nombre_pieces_principales,code_nature_culture,nature_culture,code_nature_culture_speciale,nature_culture_speciale,surface_terrain,longitude,latitude
2020-856323,2020-01-09,000001,Vente,173000,23,,RUE FRANCOIS MAURIAC,0165,60550,60670,Verneuil-en-Halatte,60,,,60670000BT0188,,,,,,,,,,,,,0,1,Maison,73,4,S,sols,,,441,2.531488,49.282342
2020-856404,2020-01-29,000001,Vente,1280000,30,,RUE MATHURIN DU RY,0296,60550,60670,Verneuil-en-Halatte,60,,,60670000BY0011,,,88,84.76,,,,,,,,,1,2,Appartement,84,4,,,,,,2.524829,49.269245
2020-856404,2020-01-29,000001,Vente,1280000,24,,RUE MATHURIN DU RY,0296,60550,60670,Verneuil-en-Halatte,60,,,60670000BY0011,,,148,,,,,,,,,,1,3,Dépendance,,0,,,,,,2.524829,49.269245
2020-856404,2020-01-29,000001,Vente,1280000,24,,RUE MATHURIN DU RY,0296,60550,60670,Verneuil-en-Halatte,60,,,60670000BY0011,,,149,,,,,,,,,,1,3,Dépendance,,0,,,,,,2.524829,49.269245
2020-856404,2020-01-29,000001,Vente,1280000,24,,RUE MATHURIN DU RY,0296,60550,60670,Verneuil-en-Halatte,60,,,60670000BY0011,,,178,,,,,,,,,,1,3,Dépendance,,0,,,,,,2.524829,49.269245
2020-856404,2020-01-29,000001,Vente,1280000,16,,RUE MATHURIN DU RY,0296,60550,60670,Verneuil-en-Halatte,60,,,60670000BY0011,,,41,116.2,,,,,,,,,1,1,Maison,116,4,,,,,,2.524829,49.269245
2020-856404,2020-01-29,000001,Vente,1280000,18,,RUE MATHURIN DU RY,0296,60550,60670,Verneuil-en-Halatte,60,,,60670000BY0011,,,42,117.51,,,,,,,,,1,1,Maison,117,4,,,,,,2.524829,49.269245
2020-856404,2020-01-29,000001,Vente,1280000,24,,RUE MATHURIN DU RY,0296,60550,60670,Verneuil-en-Halatte,60,,,60670000BY0011,,,81,84.47,,,,,,,,,1,2,Appartement,84,4,,,,,,2.524829,49.269245
2020-856404,2020-01-29,000001,Vente,1280000,30,,RUE MATHURIN DU RY,0296,60550,60670,Verneuil-en-Halatte,60,,,60670000BY0011,,,83,84.47,,,,,,,,,1,2,Appartement,84,4,,,,,,2.524829,49.269245
2020-856404,2020-01-29,000001,Vente,1280000,30,,RUE MATHURIN DU RY,0296,60550,60670,Verneuil-en-Halatte,60,,,60670000BY0011,,,85,89.48,,,,,,,,,1,2,Appartement,89,4,,,,,,2.524829,49.269245
2020-856404,2020-01-29,000001,Vente,1280000,30,,RUE MATHURIN DU RY,0296,60550,60670,Verneuil-en-Halatte,60,,,60670000BY0011,,,86,89.48,,,,,,,,,1,2,Appartement,88,4,,,,,,2.524829,49.269245
2020-856404,2020-01-29,000001,Vente,1280000,30,,RUE MATHURIN DU RY,0296,60550,60670,Verneuil-en-Halatte,60,,,60670000BY0011,,,87,84.76,,,,,,,,,1,2,Appartement,84,4,,,,,,2.524829,49.269245
2020-856404,2020-01-29,000001,Vente,1280000,24,,RUE MATHURIN DU RY,0296,60550,60670,Verneuil-en-Halatte,60,,,60670000BY0011,,,173,,,,,,,,,,1,3,Dépendance,,0,,,,,,2.524829,49.269245
2020-856404,2020-01-29,000001,Vente,1280000,24,,RUE MATHURIN DU RY,0296,60550,60670,Verneuil-en-Halatte,60,,,60670000BY0011,,,166,,,,,,,,,,1,3,Dépendance,,0,,,,,,2.524829,49.269245
2020-856404,2020-01-29,000001,Vente,1280000,24,,RUE MATHURIN DU RY,0296,60550,60670,Verneuil-en-Halatte,60,,,60670000BY0011,,,171,,,,,,,,,,1,3,Dépendance,,0,,,,,,2.524829,49.269245
2020-856404,2020-01-29,000001,Vente,1280000,24,,RUE MATHURIN DU RY,0296,60550,60670,Verneuil-en-Halatte,60,,,60670000BY0011,,,172,,,,,,,,,,1,3,Dépendance,,0,,,,,,2.524829,49.269245
2020-856404,2020-01-29,000001,Vente,1280000,24,,RUE MATHURIN DU RY,0296,60550,60670,Verneuil-en-Halatte,60,,,60670000BY0011,,,174,,,,,,,,,,1,3,Dépendance,,0,,,,,,2.524829,49.269245
2020-856404,2020-01-29,000001,Vente,1280000,24,,RUE MATHURIN DU RY,0296,60550,60670,Verneuil-en-Halatte,60,,,60670000BY0011,,,152,,,,,,,,,,1,3,Dépendance,,0,,,,,,2.524829,49.269245
2020-856414,2020-01-08,000001,Vente,130000,2,B,RUE DES PLACEAUX,0355,60550,60670,Verneuil-en-Halatte,60,,,60670000BX0092,,,,,,,,,,,,,0,1,Maison,55,3,S,sols,,,64,2.525025,49.276125
2020-856459,2020-01-29,000001,Vente,228000,68,,RUE JACQUES PREVERT,0215,60550,60670,Verneuil-en-Halatte,60,,,60670000BS0022,,,,,,,,,,,,,0,1,Maison,105,5,S,sols,,,632,2.530752,49.285216
2020-856484,2020-01-17,000001,Vente,181000,57,,RUE JEAN JACQUES FUSSIEN,0225,60550,60670,Verneuil-en-Halatte,60,,,60670000CA0088,,,,,,,,,,,,,0,1,Maison,62,3,S,sols,,,255,2.536188,49.264602
2020-856546,2020-01-23,000001,Vente,118000,16,,RUE VICTOR HUGO,0425,60550,60670,Verneuil-en-Halatte,60,,,60670000BW0008,,,,,,,,,,,,,0,1,Maison,135,6,J,jardins,,,1642,,
2020-856546,2020-01-23,000001,Vente,118000,16,,RUE VICTOR HUGO,0425,60550,60670,Verneuil-en-Halatte,60,,,60670000BW0008,,,,,,,,,,,,,0,1,Maison,135,6,S,sols,,,569,,
2020-856546,2020-01-23,000001,Vente,118000,16,,RUE VICTOR HUGO,0425,60550,60670,Verneuil-en-Halatte,60,,,60670000BW0008,,,,,,,,,,,,,0,1,Maison,135,6,BT,taillis simples,,,2866,,
2020-856556,2020-01-14,000001,Vente,129000,28,,RUE DES GROUETTES,0198,60550,60670,Verneuil-en-Halatte,60,,,60670000BX0220,,,,,,,,,,,,,0,1,Maison,103,6,S,sols,,,600,2.526569,49.273616
2020-856661,2020-02-13,000001,Vente,350000,2,,AV AIME LEPERCQ,0020,60550,60670,Verneuil-en-Halatte,60,,,60670000BE0007,,,,,,,,,,,,,0,1,Maison,164,12,S,sols,,,1457,2.499536,49.275051
2020-856729,2020-02-07,000001,Vente en l'état futur d'achèvement,5000,,,,,,60670,Verneuil-en-Halatte,60,,,60670000BM0356,,,36,,,,,,,,,,1,,,,,,,,,,2.517436,49.275738
2020-856729,2020-02-07,000001,Vente en l'état futur d'achèvement,5000,,,,,,60670,Verneuil-en-Halatte,60,,,60670000BM0356,,,35,,,,,,,,,,1,,,,,,,,,,2.517436,49.275738
2020-856755,2020-02-21,000001,Vente,216000,13,,ALL FRANCOIS VILLON,0167,60550,60670,Verneuil-en-Halatte,60,,,60670000BV0214,,,,,,,,,,,,,0,1,Maison,81,4,S,sols,,,381,2.521691,49.278612
2020-856805,2020-02-25,000001,Vente,297850,10,,ALL FRANCOIS VILLON,0167,60550,60670,Verneuil-en-Halatte,60,,,60670000BV0209,,,,,,,,,,,,,0,1,Maison,100,5,S,sols,,,404,2.521514,49.278421
2020-856835,2020-02-26,000001,Vente,220000,9,,RUE DES GRANDS JARDINS,0190,60550,60670,Verneuil-en-Halatte,60,,,60670000BN0019,,,,,,,,,,,,,0,1,Maison,65,4,S,sols,,,362,2.519466,49.282966
2020-856835,2020-02-26,000001,Vente,220000,,,LES GRANDS JARDINS,B041,60550,60670,Verneuil-en-Halatte,60,,,60670000BN0277,,,,,,,,,,,,,0,,,,,J,jardins,,,442,2.519301,49.282953
2020-856921,2020-02-12,000001,Vente,350000,,,LE TREMBLAY,B079,60550,60670,Verneuil-en-Halatte,60,,,60670000BE0075,,,2,183.3,,,,,,,,,1,1,Maison,181,4,,,,,,2.501325,49.273656
2020-856954,2020-03-06,000001,Vente,22800,,,LE BOIS DE BUFOSSE,B004,60550,60670,Verneuil-en-Halatte,60,,,60670000BS0024,,,,,,,,,,,,,0,,,,,AG,terrains d'agrément,,,456,2.530669,49.284953
2020-856985,2020-03-06,000001,Vente,260000,,,LES SABLONS,B074,60550,60670,Verneuil-en-Halatte,60,,,60670000BN0374,,,,,,,,,,,,,0,,,,,S,sols,,,301,2.523094,49.283785
2020-857089,2020-03-03,000001,Vente,179000,5,,ALL DES GENETS,0185,60550,60670,Verneuil-en-Halatte,60,,,60670000BN0151,,,,,,,,,,,,,0,1,Maison,106,5,S,sols,,,589,2.521104,49.284338
2020-857240,2020-04-03,000001,Vente,10000,,,LE PETIT HEUMONT,B058,60550,60670,Verneuil-en-Halatte,60,,,60670000BR0243,,,,,,,,,,,,,0,,,,,BP,peupleraies,,,1311,2.542518,49.295574
2020-857265,2020-04-10,000001,Vente,100000,58,,RUE DU PR CALMETTE,0367,60550,60670,Verneuil-en-Halatte,60,,,60670000BT0241,,,,,,,,,,,,,0,,,,,S,sols,,,267,2.525194,49.281913
2020-857386,2020-03-10,000001,Vente en l'état futur d'achèvement,95000,,,VERNEUIL,B082,60550,60670,Verneuil-en-Halatte,60,,,60670000BM0356,,,31,,,,,,,,,,1,3,Dépendance,,0,,,,,,2.517436,49.275738
2020-857386,2020-03-10,000001,Vente en l'état futur d'achèvement,95000,,,VERNEUIL,B082,60550,60670,Verneuil-en-Halatte,60,,,60670000BM0356,,,14,,,,,,,,,,1,2,Appartement,26,1,,,,,,2.517436,49.275738
2020-857501,2020-05-25,000001,Vente,190000,53,,RUE VICTOR HUGO,0425,60550,60670,Verneuil-en-Halatte,60,,,60670000BV0148,,,,,,,,,,,,,0,1,Maison,84,4,S,sols,,,137,2.523773,49.276312
2020-857611,2020-05-13,000001,Vente,166000,24,,RUE MATHURIN DU RY,0296,60550,60670,Verneuil-en-Halatte,60,,,60670000BY0011,,,139,,,,,,,,,,1,3,Dépendance,,0,,,,,,2.524829,49.269245
2020-857611,2020-05-13,000001,Vente,166000,26,,RUE MATHURIN DU RY,0296,60550,60670,Verneuil-en-Halatte,60,,,60670000BY0011,,,67,,,,,,,,,,1,2,Appartement,71,3,,,,,,2.524829,49.269245
2020-857611,2020-05-13,000001,Vente,166000,24,,RUE MATHURIN DU RY,0296,60550,60670,Verneuil-en-Halatte,60,,,60670000BY0011,,,160,,,,,,,,,,1,3,Dépendance,,0,,,,,,2.524829,49.269245
2020-857616,2020-05-13,000001,Vente en l'état futur d'achèvement,125000,,,VERNEUIL,B082,60550,60670,Verneuil-en-Halatte,60,,,60670000BM0356,,,39,,,,,,,,,,1,3,Dépendance,,0,,,,,,2.517436,49.275738
2020-857616,2020-05-13,000001,Vente en l'état futur d'achèvement,125000,,,VERNEUIL,B082,60550,60670,Verneuil-en-Halatte,60,,,60670000BM0356,,,15,,,,,,,,,,1,2,Appartement,36,2,,,,,,2.517436,49.275738
2020-857700,2020-05-15,000001,Vente,399177,36,,CHE DU PLESSIER,0357,60550,60670,Verneuil-en-Halatte,60,,,60670000CC0027,,,,,,,,,,,,,0,1,Maison,150,5,AG,terrains d'agrément,,,806,2.515356,49.267695
2020-857700,2020-05-15,000001,Vente,399177,36,,CHE DU PLESSIER,0357,60550,60670,Verneuil-en-Halatte,60,,,60670000CC0027,,,,,,,,,,,,,0,1,Maison,150,5,S,sols,,,500,2.515356,49.267695
2020-857745,2020-06-05,000001,Vente,200000,68,,AV DU GEN DE GAULLE,0176,60550,60670,Verneuil-en-Halatte,60,,,60670000BN0235,,,,,,,,,,,,,0,1,Maison,128,6,S,sols,,,633,2.52184,49.283086
2020-857745,2020-06-05,000001,Vente,200000,,,LES SABLONS,B074,60550,60670,Verneuil-en-Halatte,60,,,60670000BN0272,,,,,,,,,,,,,0,,,,,J,jardins,,,231,2.522016,49.283043
2020-857799,2020-05-20,000001,Vente,228280,65,,RUE VICTOR HUGO,0425,60550,60670,Verneuil-en-Halatte,60,,,60670000BV0141,,,,,,,,,,,,,0,1,Maison,90,5,S,sols,,,168,2.524287,49.276512
2020-857803,2020-05-26,000001,Vente en l'état futur d'achèvement,126000,,,VERNEUIL,B082,60550,60670,Verneuil-en-Halatte,60,,,60670000BM0356,,,26,,,,,,,,,,1,3,Dépendance,,0,,,,,,2.517436,49.275738
2020-857803,2020-05-26,000001,Vente en l'état futur d'achèvement,126000,,,VERNEUIL,B082,60550,60670,Verneuil-en-Halatte,60,,,60670000BM0356,,,8,,,,,,,,,,1,2,Appartement,35,2,,,,,,2.517436,49.275738
2020-857830,2020-05-20,000001,Vente,365000,,,LE HAUT DE FRANCE,B046,60550,60670,Verneuil-en-Halatte,60,,,60670000BV0035,,,,,,,,,,,,,0,,,,,J,jardins,,,124,2.525643,49.276982
2020-857830,2020-05-20,000001,Vente,365000,8,,RUE DU PR CALMETTE,0367,60550,60670,Verneuil-en-Halatte,60,,,60670000BV0036,,,,,,,,,,,,,0,1,Maison,155,6,S,sols,,,483,2.524953,49.27688
2020-857830,2020-05-20,000001,Vente,365000,8,,RUE DU PR CALMETTE,0367,60550,60670,Verneuil-en-Halatte,60,,,60670000BV0036,,,,,,,,,,,,,0,1,Maison,155,6,J,jardins,,,898,2.524953,49.27688
2020-857830,2020-05-20,000001,Vente,365000,,,LE HAUT DE FRANCE,B046,60550,60670,Verneuil-en-Halatte,60,,,60670000BV0038,,,,,,,,,,,,,0,,,,,J,jardins,,,150,2.525519,49.277144
2020-858002,2020-06-04,000002,Vente,170000,21,,RUE DES BOIS,0080,60550,60670,Verneuil-en-Halatte,60,,,60670000BR0277,,,,,,,,,,,,,0,1,Maison,72,3,S,sols,,,279,2.540262,49.292003
2020-858049,2020-06-18,000001,Vente,228000,50,,RUE DE LA VALLEE STE GENEVIEVE,0415,60550,60670,Verneuil-en-Halatte,60,,,60670000BX0044,,,,,,,,,,,,,0,1,Maison,87,4,J,jardins,,,724,2.529021,49.273525
2020-858049,2020-06-18,000001,Vente,228000,50,,RUE DE LA VALLEE STE GENEVIEVE,0415,60550,60670,Verneuil-en-Halatte,60,,,60670000BX0044,,,,,,,,,,,,,0,1,Maison,87,4,S,sols,,,500,2.529021,49.273525
2020-858049,2020-06-18,000001,Vente,228000,,,LA FONTAINE STE GENEVIEVE,B034,60550,60670,Verneuil-en-Halatte,60,,,60670000BX0196,,,,,,,,,,,,,0,,,,,S,sols,,,4,2.529318,49.273854
2020-858066,2020-06-18,000001,Vente,220900,52,,RUE DES BOIS,0080,60550,60670,Verneuil-en-Halatte,60,,,60670000BR0217,,,,,,,,,,,,,0,1,Maison,84,2,S,sols,,,358,2.544426,49.29329
2020-858114,2020-07-07,000001,Vente,2315000,,,LE MONCHELLE,B052,60550,60670,Verneuil-en-Halatte,60,,,60670000AW0048,,,,,,,,,,,,,0,,,,,L,landes,,,21073,,
2020-858114,2020-07-07,000001,Vente,2315000,,,LE MONCHELLE,B052,60550,60670,Verneuil-en-Halatte,60,,,60670000AW0049,,,,,,,,,,,,,0,,,,,B,bois,,,13615,,
2020-858114,2020-07-07,000001,Vente,2315000,,,LE MONCHELLE,B052,60550,60670,Verneuil-en-Halatte,60,,,60670000AW0050,,,,,,,,,,,,,0,,,,,S,sols,,,4395,,
2020-858114,2020-07-07,000001,Vente,2315000,,,LE MONCHELLE,B052,60550,60670,Verneuil-en-Halatte,60,,,60670000AW0051,,,,,,,,,,,,,0,,,,,BT,taillis simples,,,3095,,
2020-858114,2020-07-07,000001,Vente,2315000,5052,F,INSTITUT GEOGRAPHIQUE NATI,A030,60550,60670,Verneuil-en-Halatte,60,,,60670000AW0052,,,,,,,,,,,,,0,1,Maison,61,3,S,sols,,,8635,,
2020-858114,2020-07-07,000001,Vente,2315000,5052,F,INSTITUT GEOGRAPHIQUE NATI,A030,60550,60670,Verneuil-en-Halatte,60,,,60670000AW0052,,,,,,,,,,,,,0,1,Maison,61,3,S,sols,,,8635,,
2020-858114,2020-07-07,000001,Vente,2315000,,,LE MONCHELLE,B052,60550,60670,Verneuil-en-Halatte,60,,,60670000AW0055,,,,,,,,,,,,,0,,,,,L,landes,,,6545,2.511549,49.261936
2020-858114,2020-07-07,000001,Vente,2315000,,,LE MONCHELLE,B052,60550,60670,Verneuil-en-Halatte,60,,,60670000AW0056,,,,,,,,,,,,,0,,,,,L,landes,,,32105,,
2020-858114,2020-07-07,000001,Vente,2315000,,,LE MONCHELLE,B052,60550,60670,Verneuil-en-Halatte,60,,,60670000AW0092,,,,,,,,,,,,,0,,,,,S,sols,,,782,2.515668,49.260539
2020-858114,2020-07-07,000001,Vente,2315000,,,LE MONCHELLE,B052,60550,60670,Verneuil-en-Halatte,60,,,60670000AW0093,,,,,,,,,,,,,0,,,,,S,sols,,,100,2.515064,49.260614
2020-858114,2020-07-07,000001,Vente,2315000,,,LE MONCHELLE,B052,60550,60670,Verneuil-en-Halatte,60,,,60670000AW0100,,,,,,,,,,,,,0,,,,,S,sols,,,5100,,
2020-858114,2020-07-07,000001,Vente,2315000,,,LE MONCHELLE,B052,60550,60670,Verneuil-en-Halatte,60,,,60670000AW0101,,,,,,,,,,,,,0,,,,,S,sols,,,90,2.510137,49.263195
2020-858114,2020-07-07,000001,Vente,2315000,,,LE MONCHELLE,B052,60550,60670,Verneuil-en-Halatte,60,,,60670000AW0102,,,,,,,,,,,,,0,,,,,S,sols,,,30,2.51323,49.264268
2020-858114,2020-07-07,000001,Vente,2315000,5103,F,INSTITUT GEOGRAPHIQUE NATI,A030,60550,60670,Verneuil-en-Halatte,60,,,60670000AW0103,,,,,,,,,,,,,0,4,Local industriel. commercial ou assimilé,9026,0,S,sols,,,34925,,
2020-858114,2020-07-07,000001,Vente,2315000,5103,F,INSTITUT GEOGRAPHIQUE NATI,A030,60550,60670,Verneuil-en-Halatte,60,,,60670000AW0103,,,,,,,,,,,,,0,4,Local industriel. commercial ou assimilé,1387,0,S,sols,,,34925,,
2020-858116,2020-06-25,000001,Vente,90000,,,LE VEAUCEL,B081,60550,60670,Verneuil-en-Halatte,60,,,60670000BL0144,,,,,,,,,,,,,0,,,,,AB,terrains a bâtir,,,747,2.512035,49.27318
2020-858116,2020-06-25,000002,Vente,90000,,,LE VEAUCEL,B081,60550,60670,Verneuil-en-Halatte,60,,,60670000BL0143,,,,,,,,,,,,,0,,,,,AB,terrains a bâtir,,,700,2.512035,49.273377
2020-858413,2020-07-23,000001,Vente,310000,10,,ALL DU JARDINIER,0219,60550,60670,Verneuil-en-Halatte,60,,,60670000BW0056,,,,,,,,,,,,,0,1,Maison,112,6,S,sols,,,508,2.523584,49.275453
2020-858427,2020-07-15,000001,Vente,270000,5,,PL DU GEN SARRAIL,0180,60550,60670,Verneuil-en-Halatte,60,,,60670000BK0099,,,,,,,,,,,,,0,1,Maison,108,4,J,jardins,,,583,2.514491,49.277867
2020-858427,2020-07-15,000001,Vente,270000,5,,PL DU GEN SARRAIL,0180,60550,60670,Verneuil-en-Halatte,60,,,60670000BK0099,,,,,,,,,,,,,0,1,Maison,108,4,S,sols,,,500,2.514491,49.277867
2020-858566,2020-07-15,000001,Vente,368000,13,,RUE DU PDT WILSON,0365,60550,60670,Verneuil-en-Halatte,60,,,60670000BY0046,,,,,,,,,,,,,0,1,Maison,96,6,S,sols,,,500,2.523544,49.268989
2020-858566,2020-07-15,000001,Vente,368000,13,,RUE DU PDT WILSON,0365,60550,60670,Verneuil-en-Halatte,60,,,60670000BY0046,,,,,,,,,,,,,0,1,Maison,96,6,J,jardins,,,720,2.523544,49.268989
2020-858577,2020-07-30,000001,Vente,188000,34,,RUE JEAN JAURES,0227,60550,60670,Verneuil-en-Halatte,60,,,60670000BM0119,,,,,,,,,,,,,0,1,Maison,99,4,S,sols,,,149,2.516566,49.276441
2020-858577,2020-07-30,000001,Vente,188000,,,VERNEUIL,B082,60550,60670,Verneuil-en-Halatte,60,,,60670000BM0121,,,,,,,,,,,,,0,,,,,J,jardins,,,140,2.517041,49.276563
2020-858599,2020-07-20,000001,Echange,116545,,,L ARGILIERE,B001,60550,60670,Verneuil-en-Halatte,60,,,60670000AY0059,,,,,,,,,,,,,0,,,,,T,terres,,,7030,2.546071,49.256363
2020-858599,2020-07-20,000001,Echange,116545,,,L ARGILIERE,B001,60550,60670,Verneuil-en-Halatte,60,,,60670000AY0060,,,,,,,,,,,,,0,,,,,T,terres,,,190,2.546107,49.256169
2020-858599,2020-07-20,000001,Echange,116545,,,L ARGILIERE,B001,60550,60670,Verneuil-en-Halatte,60,,,60670000AY0061,,,,,,,,,,,,,0,,,,,T,terres,,,981,2.546285,49.256182
2020-858599,2020-07-20,000001,Echange,116545,,,L ARGILIERE,B001,60550,60670,Verneuil-en-Halatte,60,,,60670000AY0062,,,,,,,,,,,,,0,,,,,T,terres,,,4485,2.546722,49.256395
2020-858599,2020-07-20,000001,Echange,116545,,,L ARGILIERE,B001,60550,60670,Verneuil-en-Halatte,60,,,60670000AY0063,,,,,,,,,,,,,0,,,,,T,terres,,,5085,2.546643,49.256987
2020-858599,2020-07-20,000001,Echange,116545,,,L ARGILIERE,B001,60550,60670,Verneuil-en-Halatte,60,,,60670000AY0065,,,,,,,,,,,,,0,,,,,T,terres,,,4666,2.547464,49.256646
2020-858599,2020-07-20,000001,Echange,116545,,,L ARGILIERE,B001,60550,60670,Verneuil-en-Halatte,60,,,60670000AY0065,,,,,,,,,,,,,0,,,,,T,terres,,,1555,2.547464,49.256646
2020-858599,2020-07-20,000001,Echange,116545,,,L ARGILIERE,B001,60550,60670,Verneuil-en-Halatte,60,,,60670000AY0066,,,,,,,,,,,,,0,,,,,T,terres,,,335,2.547829,49.256345
2020-858599,2020-07-20,000001,Echange,116545,,,L ARGILIERE,B001,60550,60670,Verneuil-en-Halatte,60,,,60670000AY0066,,,,,,,,,,,,,0,,,,,T,terres,,,1674,2.547829,49.256345
2020-858599,2020-07-20,000001,Echange,116545,,,L ARGILIERE,B001,60550,60670,Verneuil-en-Halatte,60,,,60670000AY0067,,,,,,,,,,,,,0,,,,,T,terres,,,3119,2.548279,49.256473
2020-858599,2020-07-20,000001,Echange,116545,,,L ARGILIERE,B001,60550,60670,Verneuil-en-Halatte,60,,,60670000AY0067,,,,,,,,,,,,,0,,,,,T,terres,,,624,2.548279,49.256473
2020-858599,2020-07-20,000001,Echange,116545,,,L ARGILIERE,B001,60550,60670,Verneuil-en-Halatte,60,,,60670000AY0068,,,,,,,,,,,,,0,,,,,T,terres,,,2533,2.54857,49.25626
2020-858599,2020-07-20,000001,Echange,116545,,,L ARGILIERE,B001,60550,60670,Verneuil-en-Halatte,60,,,60670000AY0068,,,,,,,,,,,,,0,,,,,T,terres,,,507,2.54857,49.25626
2020-858599,2020-07-20,000001,Echange,116545,,,L ARGILIERE,B001,60550,60670,Verneuil-en-Halatte,60,,,60670000AY0069,,,,,,,,,,,,,0,,,,,T,terres,,,1806,2.549126,49.256385
2020-858599,2020-07-20,000001,Echange,116545,,,L ARGILIERE,B001,60550,60670,Verneuil-en-Halatte,60,,,60670000AY0069,,,,,,,,,,,,,0,,,,,T,terres,,,602,2.549126,49.256385
2020-858599,2020-07-20,000001,Echange,116545,,,L ARGILIERE,B001,60550,60670,Verneuil-en-Halatte,60,,,60670000AY0070,,,,,,,,,,,,,0,,,,,T,terres,,,979,2.549448,49.256337
2020-858599,2020-07-20,000001,Echange,116545,,,L ARGILIERE,B001,60550,60670,Verneuil-en-Halatte,60,,,60670000AY0070,,,,,,,,,,,,,0,,,,,T,terres,,,326,2.549448,49.256337
2020-858599,2020-07-20,000001,Echange,116545,,,L ARGILIERE,B001,60550,60670,Verneuil-en-Halatte,60,,,60670000AY0071,,,,,,,,,,,,,0,,,,,T,terres,,,870,2.549678,49.256299
2020-858599,2020-07-20,000001,Echange,116545,,,L ARGILIERE,B001,60550,60670,Verneuil-en-Halatte,60,,,60670000AY0071,,,,,,,,,,,,,0,,,,,T,terres,,,290,2.549678,49.256299
2020-858599,2020-07-20,000001,Echange,116545,,,L ARGILIERE,B001,60550,60670,Verneuil-en-Halatte,60,,,60670000AY0075,,,,,,,,,,,,,0,,,,,T,terres,,,449,2.550413,49.256223
2020-858599,2020-07-20,000001,Echange,116545,,,L ARGILIERE,B001,60550,60670,Verneuil-en-Halatte,60,,,60670000AY0075,,,,,,,,,,,,,0,,,,,T,terres,,,450,2.550413,49.256223
2020-858599,2020-07-20,000001,Echange,116545,,,L ARGILIERE,B001,60550,60670,Verneuil-en-Halatte,60,,,60670000AY0076,,,,,,,,,,,,,0,,,,,T,terres,,,1104,2.550667,49.256111
2020-858599,2020-07-20,000001,Echange,116545,,,L ARGILIERE,B001,60550,60670,Verneuil-en-Halatte,60,,,60670000AY0077,,,,,,,,,,,,,0,,,,,T,terres,,,126,2.55107,49.256034
2020-858599,2020-07-20,000001,Echange,116545,,,L ARGILIERE,B001,60550,60670,Verneuil-en-Halatte,60,,,60670000AY0078,,,,,,,,,,,,,0,,,,,T,terres,,,65,2.551242,49.256043
2020-858599,2020-07-20,000001,Echange,116545,,,L ARGILIERE,B001,60550,60670,Verneuil-en-Halatte,60,,,60670000AY0079,,,,,,,,,,,,,0,,,,,T,terres,,,34,2.551413,49.256048
2020-858599,2020-07-20,000001,Echange,116545,,,L ARGILIERE,B001,60550,60670,Verneuil-en-Halatte,60,,,60670000AY0083,,,,,,,,,,,,,0,,,,,T,terres,,,1267,2.551778,49.255129
2020-858599,2020-07-20,000001,Echange,116545,,,L ARGILIERE,B001,60550,60670,Verneuil-en-Halatte,60,,,60670000AY0084,,,,,,,,,,,,,0,,,,,T,terres,,,4176,2.551711,49.255293
2020-858599,2020-07-20,000001,Echange,116545,,,L ARGILIERE,B001,60550,60670,Verneuil-en-Halatte,60,,,60670000AY0086,,,,,,,,,,,,,0,,,,,T,terres,,,2108,2.551254,49.255194
2020-858599,2020-07-20,000001,Echange,116545,,,L ARGILIERE,B001,60550,60670,Verneuil-en-Halatte,60,,,60670000AY0088,,,,,,,,,,,,,0,,,,,T,terres,,,2312,2.550844,49.255232
2020-858599,2020-07-20,000001,Echange,116545,,,L ARGILIERE,B001,60550,60670,Verneuil-en-Halatte,60,,,60670000AY0089,,,,,,,,,,,,,0,,,,,T,terres,,,2234,2.550618,49.255255
2020-858599,2020-07-20,000001,Echange,116545,,,L ARGILIERE,B001,60550,60670,Verneuil-en-Halatte,60,,,60670000AY0090,,,,,,,,,,,,,0,,,,,T,terres,,,1742,2.550405,49.255275
2020-858599,2020-07-20,000001,Echange,116545,,,L ARGILIERE,B001,60550,60670,Verneuil-en-Halatte,60,,,60670000AY0091,,,,,,,,,,,,,0,,,,,T,terres,,,5076,2.550076,49.255303
2020-858599,2020-07-20,000001,Echange,116545,,,L ARGILIERE,B001,60550,60670,Verneuil-en-Halatte,60,,,60670000AY0092,,,,,,,,,,,,,0,,,,,T,terres,,,2334,2.549636,49.255353
2020-858599,2020-07-20,000001,Echange,116545,,,L ARGILIERE,B001,60550,60670,Verneuil-en-Halatte,60,,,60670000AY0096,,,,,,,,,,,,,0,,,,,T,terres,,,1855,2.548906,49.255413
2020-858599,2020-07-20,000001,Echange,116545,,,L ARGILIERE,B001,60550,60670,Verneuil-en-Halatte,60,,,60670000AY0097,,,,,,,,,,,,,0,,,,,T,terres,,,1532,2.548853,49.255647
2020-858599,2020-07-20,000001,Echange,116545,,,L ARGILIERE,B001,60550,60670,Verneuil-en-Halatte,60,,,60670000AY0098,,,,,,,,,,,,,0,,,,,T,terres,,,1796,2.548585,49.255707
2020-858599,2020-07-20,000001,Echange,116545,,,L ARGILIERE,B001,60550,60670,Verneuil-en-Halatte,60,,,60670000AY0099,,,,,,,,,,,,,0,,,,,T,terres,,,1092,2.548152,49.255688
2020-858599,2020-07-20,000001,Echange,116545,,,L ARGILIERE,B001,60550,60670,Verneuil-en-Halatte,60,,,60670000AY0100,,,,,,,,,,,,,0,,,,,T,terres,,,260,2.547898,49.255783
2020-858599,2020-07-20,000001,Echange,116545,,,L ARGILIERE,B001,60550,60670,Verneuil-en-Halatte,60,,,60670000AY0101,,,,,,,,,,,,,0,,,,,T,terres,,,76,2.547764,49.255779
2020-858599,2020-07-20,000001,Echange,116545,,,L ARGILIERE,B001,60550,60670,Verneuil-en-Halatte,60,,,60670000AY0102,,,,,,,,,,,,,0,,,,,T,terres,,,2697,2.547958,49.255402
2020-858599,2020-07-20,000001,Echange,116545,,,L ARGILIERE,B001,60550,60670,Verneuil-en-Halatte,60,,,60670000AY0103,,,,,,,,,,,,,0,,,,,T,terres,,,240,2.547449,49.25593
2020-858599,2020-07-20,000001,Echange,116545,,,L ARGILIERE,B001,60550,60670,Verneuil-en-Halatte,60,,,60670000AY0107,,,,,,,,,,,,,0,,,,,T,terres,,,203,2.546932,49.256018
2020-858599,2020-07-20,000001,Echange,116545,,,L ARGILIERE,B001,60550,60670,Verneuil-en-Halatte,60,,,60670000AY0108,,,,,,,,,,,,,0,,,,,T,terres,,,132,2.546855,49.255987
2020-858599,2020-07-20,000001,Echange,116545,,,L ARGILIERE,B001,60550,60670,Verneuil-en-Halatte,60,,,60670000AY0111,,,,,,,,,,,,,0,,,,,T,terres,,,162,2.546736,49.25596
2020-858599,2020-07-20,000001,Echange,116545,,,L ARGILIERE,B001,60550,60670,Verneuil-en-Halatte,60,,,60670000AY0112,,,,,,,,,,,,,0,,,,,T,terres,,,17,2.546645,49.255966
2020-858599,2020-07-20,000002,Echange,116545,,,LES LONGUES RAIES,B050,60550,60670,Verneuil-en-Halatte,60,,,60670000AV0270,,,,,,,,,,,,,0,,,,,T,terres,,,610,2.508205,49.267842