id_mutation,date_mutation,numero_disposition,nature_mutation,valeur_fonciere,adresse_numero,adresse_suffixe,adresse_nom_voie,adresse_code_voie,code_postal,code_commune,nom_commune,code_departement,ancien_code_commune,ancien_nom_commune,id_parcelle,ancien_id_parcelle,numero_volume,lot1_numero,lot1_surface_carrez,lot2_numero,lot2_surface_carrez,lot3_numero,lot3_surface_carrez,lot4_numero,lot4_surface_carrez,lot5_numero,lot5_surface_carrez,nombre_lots,code_type_local,type_local,surface_reelle_bati,nombre_pieces_principales,code_nature_culture,nature_culture,code_nature_culture_speciale,nature_culture_speciale,surface_terrain,longitude,latitude
2020-862787,2020-01-23,000001,Vente,85000,103,,BOURG DE LONLAY,B017,61600,61233,Lonlay-le-Tesson,61,,,61233000ZN0063,,,,,,,,,,,,,0,1,Maison,57,2,,,,,,-0.352256,48.64315
2020-862867,2020-01-31,000001,Vente,20300,,,GRAND ROCHER,B112,61600,61233,Lonlay-le-Tesson,61,,,61233000ZK0020,,,,,,,,,,,,,0,,,,,P,prés,,,20130,-0.313353,48.669293
2020-862867,2020-01-31,000001,Vente,20300,,,PRE DE ROUVRETTE,B171,61600,61233,Lonlay-le-Tesson,61,,,61233000ZL0019,,,,,,,,,,,,,0,,,,,P,prés,,,23820,-0.305569,48.663082
2020-865229,2020-07-09,000001,Vente,165000,130,,BOIS-JARDIN,B013,61600,61233,Lonlay-le-Tesson,61,,,61233000ZC0025,,,,,,,,,,,,,0,1,Maison,119,6,S,sols,,,1000,-0.355271,48.644595
2020-865229,2020-07-09,000001,Vente,165000,130,,BOIS-JARDIN,B013,61600,61233,Lonlay-le-Tesson,61,,,61233000ZC0025,,,,,,,,,,,,,0,1,Maison,119,6,AG,terrains d'agrément,PARC,Parc,3850,-0.355271,48.644595
2020-865588,2020-07-15,000001,Vente,80000,126,,LE BOURG,B016,61600,61233,Lonlay-le-Tesson,61,,,61233000ZN0057,,,,,,,,,,,,,0,,,,,P,prés,,,1345,-0.350603,48.643154
2020-865588,2020-07-15,000001,Vente,80000,126,,LE BOURG,B016,61600,61233,Lonlay-le-Tesson,61,,,61233000ZN0057,,,,,,,,,,,,,0,,,,,S,sols,,,398,-0.350603,48.643154
2020-865685,2020-07-29,000001,Vente,165000,5025,,LES GRANDS PARCS,B120,61600,61233,Lonlay-le-Tesson,61,,,61233000ZN0062,,,,,,,,,,,,,0,1,Maison,123,5,S,sols,,,1000,-0.349801,48.64316
2020-865685,2020-07-29,000001,Vente,165000,5025,,LES GRANDS PARCS,B120,61600,61233,Lonlay-le-Tesson,61,,,61233000ZN0062,,,,,,,,,,,,,0,1,Maison,123,5,AG,terrains d'agrément,PARC,Parc,490,-0.349801,48.64316
2020-866834,2020-09-29,000001,Vente,32500,,,LA BLANCHARDIERE,B007,61600,61233,Lonlay-le-Tesson,61,,,61233000ZI0067,,,,,,,,,,,,,0,,,,,S,sols,,,191,-0.328905,48.663491
2020-866834,2020-09-29,000001,Vente,32500,,,LA BLANCHARDIERE,B007,61600,61233,Lonlay-le-Tesson,61,,,61233000ZI0069,,,,,,,,,,,,,0,,,,,S,sols,,,11835,-0.32971,48.663887
2020-867276,2020-10-21,000001,Vente,76000,,,LA BLANCHARDIERE,B007,61600,61233,Lonlay-le-Tesson,61,,,61233000ZI0010,,,,,,,,,,,,,0,,,,,P,prés,,,32830,-0.325858,48.664117
2020-867276,2020-10-21,000001,Vente,76000,,,LA BLANCHARDIERE,B007,61600,61233,Lonlay-le-Tesson,61,,,61233000ZI0010,,,,,,,,,,,,,0,,,,,T,terres,,,11595,-0.325858,48.664117
2020-867276,2020-10-21,000001,Vente,76000,,,LA BLANCHARDIERE,B007,61600,61233,Lonlay-le-Tesson,61,,,61233000ZI0010,,,,,,,,,,,,,0,,,,,T,terres,,,5545,-0.325858,48.664117
2020-867276,2020-10-21,000001,Vente,76000,,,LA BLANCHARDIERE,B007,61600,61233,Lonlay-le-Tesson,61,,,61233000ZI0016,,,,,,,,,,,,,0,,,,,T,terres,,,2650,-0.323967,48.662557
2020-867276,2020-10-21,000001,Vente,76000,,,LA BLANCHARDIERE,B007,61600,61233,Lonlay-le-Tesson,61,,,61233000ZI0016,,,,,,,,,,,,,0,,,,,P,prés,,,2970,-0.323967,48.662557
2020-867276,2020-10-21,000001,Vente,76000,,,LA BLANCHARDIERE,B007,61600,61233,Lonlay-le-Tesson,61,,,61233000ZI0016,,,,,,,,,,,,,0,,,,,L,landes,FRICH,Friche,300,-0.323967,48.662557
2020-867276,2020-10-21,000001,Vente,76000,,,LA BLANCHARDIERE,B007,61600,61233,Lonlay-le-Tesson,61,,,61233000ZI0048,,,,,,,,,,,,,0,,,,,P,prés,,,13598,-0.326728,48.661613
2020-867276,2020-10-21,000001,Vente,76000,,,LA BLANCHARDIERE,B007,61600,61233,Lonlay-le-Tesson,61,,,61233000ZI0048,,,,,,,,,,,,,0,,,,,S,sols,,,454,-0.326728,48.661613
2020-867276,2020-10-21,000001,Vente,76000,,,LA BLANCHARDIERE,B007,61600,61233,Lonlay-le-Tesson,61,,,61233000ZI0048,,,,,,,,,,,,,0,,,,,P,prés,,,42625,-0.326728,48.661613
2020-867276,2020-10-21,000001,Vente,76000,,,LA BLANCHARDIERE,B007,61600,61233,Lonlay-le-Tesson,61,,,61233000ZI0048,,,,,,,,,,,,,0,,,,,P,prés,,,13768,-0.326728,48.661613
2020-867276,2020-10-21,000001,Vente,76000,,,LA BLANCHARDIERE,B007,61600,61233,Lonlay-le-Tesson,61,,,61233000ZI0048,,,,,,,,,,,,,0,,,,,T,terres,,,6220,-0.326728,48.661613
2020-867276,2020-10-21,000001,Vente,76000,,,LA BLANCHARDIERE,B007,61600,61233,Lonlay-le-Tesson,61,,,61233000ZI0050,,,,,,,,,,,,,0,,,,,T,terres,,,12764,-0.326654,48.6627
2020-867276,2020-10-21,000001,Vente,76000,,,LA BLANCHARDIERE,B007,61600,61233,Lonlay-le-Tesson,61,,,61233000ZI0050,,,,,,,,,,,,,0,,,,,P,prés,,,5451,-0.326654,48.6627
2020-867276,2020-10-21,000001,Vente,76000,,,LE PERCHE,B151,61600,61233,Lonlay-le-Tesson,61,,,61233000ZK0004,,,,,,,,,,,,,0,,,,,P,prés,,,14407,-0.321225,48.670677
2020-867276,2020-10-21,000001,Vente,76000,,,LE PERCHE,B151,61600,61233,Lonlay-le-Tesson,61,,,61233000ZK0004,,,,,,,,,,,,,0,,,,,T,terres,,,10046,-0.321225,48.670677
2020-867276,2020-10-21,000001,Vente,76000,,,LE PERCHE,B151,61600,61233,Lonlay-le-Tesson,61,,,61233000ZK0004,,,,,,,,,,,,,0,,,,,T,terres,,,19807,-0.321225,48.670677
2020-867276,2020-10-21,000001,Vente,76000,,,LE PERCHE,B151,61600,61233,Lonlay-le-Tesson,61,,,61233000ZK0004,,,,,,,,,,,,,0,,,,,S,sols,,,30,-0.321225,48.670677
2020-867488,2020-10-21,000001,Vente,44335.5,,,LES CHAMPONS,B056,61600,61233,Lonlay-le-Tesson,61,,,61233000ZC0017,,,,,,,,,,,,,0,,,,,T,terres,,,21390,-0.339733,48.648172
2020-867488,2020-10-21,000001,Vente,44335.5,,,LES GAGES,B095,61600,61233,Lonlay-le-Tesson,61,,,61233000ZC0018,,,,,,,,,,,,,0,,,,,T,terres,,,59220,-0.34195,48.647376
