id_mutation,date_mutation,numero_disposition,nature_mutation,valeur_fonciere,adresse_numero,adresse_suffixe,adresse_nom_voie,adresse_code_voie,code_postal,code_commune,nom_commune,code_departement,ancien_code_commune,ancien_nom_commune,id_parcelle,ancien_id_parcelle,numero_volume,lot1_numero,lot1_surface_carrez,lot2_numero,lot2_surface_carrez,lot3_numero,lot3_surface_carrez,lot4_numero,lot4_surface_carrez,lot5_numero,lot5_surface_carrez,nombre_lots,code_type_local,type_local,surface_reelle_bati,nombre_pieces_principales,code_nature_culture,nature_culture,code_nature_culture_speciale,nature_culture_speciale,surface_terrain,longitude,latitude
2020-862609,2020-01-07,000001,Vente,108000,,,LA CHABOSSIERE,B006,61320,61420,Sainte-Marie-la-Robert,61,,,61420000ZC0253,,,,,,,,,,,,,0,,,,,J,jardins,POTAG,Jardin potager,690,-0.144259,48.622968
2020-862609,2020-01-07,000001,Vente,108000,,,LA CHABOSSIERE,B006,61320,61420,Sainte-Marie-la-Robert,61,,,61420000ZC0253,,,,,,,,,,,,,0,,,,,S,sols,,,55,-0.144259,48.622968
2020-862609,2020-01-07,000001,Vente,108000,36,,LA CHABOSSIERE,B006,61320,61420,Sainte-Marie-la-Robert,61,,,61420000ZC0254,,,,,,,,,,,,,0,1,Maison,87,3,S,sols,,,500,-0.144181,48.622923
2020-862609,2020-01-07,000001,Vente,108000,,,LA CHABOSSIERE,B006,61320,61420,Sainte-Marie-la-Robert,61,,,61420000ZC0260,,,,,,,,,,,,,0,,,,,J,jardins,POTAG,Jardin potager,215,-0.143806,48.622701
2020-862609,2020-01-07,000001,Vente,108000,66,,LA CHABOSSIERE,B006,61320,61420,Sainte-Marie-la-Robert,61,,,61420000ZC0262,,,,,,,,,,,,,0,1,Maison,41,1,S,sols,,,565,-0.143672,48.622839
2020-862609,2020-01-07,000001,Vente,108000,,,LA CHABOSSIERE,B006,61320,61420,Sainte-Marie-la-Robert,61,,,61420000ZC0264,,,,,,,,,,,,,0,,,,,S,sols,,,5,-0.143573,48.622747
2020-865994,2020-08-18,000001,Vente,49722.75,,,L ETRE DU BOIS,B015,61320,61420,Sainte-Marie-la-Robert,61,,,61420000ZD0064,,,,,,,,,,,,,0,,,,,P,prés,,,4966,-0.141974,48.613082
2020-865994,2020-08-18,000001,Vente,49722.75,,,L ETRE DU BOIS,B015,61320,61420,Sainte-Marie-la-Robert,61,,,61420000ZD0064,,,,,,,,,,,,,0,,,,,P,prés,,,4966,-0.141974,48.613082
2020-865994,2020-08-18,000001,Vente,49722.75,,,LA COUTURE,B013,61320,61420,Sainte-Marie-la-Robert,61,,,61420000ZD0116,,,,,,,,,,,,,0,,,,,P,prés,,,48749,-0.144278,48.610505
2020-865994,2020-08-18,000001,Vente,49722.75,,,LA COUTURE,B013,61320,61420,Sainte-Marie-la-Robert,61,,,61420000ZD0116,,,,,,,,,,,,,0,,,,,BT,taillis simples,,,11949,-0.144278,48.610505
