id_mutation,date_mutation,numero_disposition,nature_mutation,valeur_fonciere,adresse_numero,adresse_suffixe,adresse_nom_voie,adresse_code_voie,code_postal,code_commune,nom_commune,code_departement,ancien_code_commune,ancien_nom_commune,id_parcelle,ancien_id_parcelle,numero_volume,lot1_numero,lot1_surface_carrez,lot2_numero,lot2_surface_carrez,lot3_numero,lot3_surface_carrez,lot4_numero,lot4_surface_carrez,lot5_numero,lot5_surface_carrez,nombre_lots,code_type_local,type_local,surface_reelle_bati,nombre_pieces_principales,code_nature_culture,nature_culture,code_nature_culture_speciale,nature_culture_speciale,surface_terrain,longitude,latitude
2020-869162,2020-01-11,000001,Vente,2810,,,LES MILANAIS,B041,62217,62004,Achicourt,62,,,62004000AV0062,,,,,,,,,,,,,0,,,,,J,jardins,,,562,2.759563,50.276336
2020-869173,2020-01-11,000001,Vente,63200,35,,RUE RAOUL BRIQUET,0610,62217,62004,Achicourt,62,,,62004000AW0295,,,7,38.77,,,,,,,,,1,2,Appartement,39,2,,,,,,2.763134,50.276735
2020-869173,2020-01-11,000001,Vente,63200,35,,RUE RAOUL BRIQUET,0610,62217,62004,Achicourt,62,,,62004000AW0295,,,10,,,,,,,,,,1,3,Dépendance,,0,,,,,,2.763134,50.276735
2020-869208,2020-01-20,000001,Vente,160000,9001,,PL DE FLERS DE L ORNE,0325,62217,62004,Achicourt,62,,,62004000BA0162,,,32,82.44,,,,,,,,,1,4,Local industriel. commercial ou assimilé,454,0,,,,,,2.771846,50.271266
2020-869220,2020-01-07,000001,Vente,155000,5,,RUE EMILE BASLY,0230,62217,62004,Achicourt,62,,,62004000AV0329,,,,,,,,,,,,,0,1,Maison,99,4,S,sols,,,177,2.759089,50.273077
2020-869220,2020-01-07,000001,Vente,155000,5,,RUE EMILE BASLY,0230,62217,62004,Achicourt,62,,,62004000AV0330,,,,,,,,,,,,,0,,,,,J,jardins,,,260,2.759322,50.272972
2020-869220,2020-01-07,000001,Vente,155000,,,LES BOUQUETS DE FLEURS,B005,62217,62004,Achicourt,62,,,62004000AV0331,,,,,,,,,,,,,0,,,,,J,jardins,,,264,2.759733,50.272829
2020-869253,2020-01-15,000002,Vente,157600,3,,RUE DE LISBONNE,0482,62217,62004,Achicourt,62,,,62004000AZ0865,,,,,,,,,,,,,0,1,Maison,65,4,S,sols,,,408,2.778689,50.269941
2020-869253,2020-01-15,000002,Vente,157600,,,RUE DE LISBONNE,0482,62217,62004,Achicourt,62,,,62004000AZ0867,,,,,,,,,,,,,0,,,,,S,sols,,,32,2.778774,50.270056
2020-869253,2020-01-15,000002,Vente,157600,,,RUE DE BELGRADE,0057,62217,62004,Achicourt,62,,,62004000AZ0869,,,,,,,,,,,,,0,,,,,S,sols,,,61,2.778748,50.270088
2020-869312,2020-01-27,000001,Vente,173500,4,,RUE LUCIE AUBRAC,0487,62217,62004,Achicourt,62,,,62004000BE0248,,,,,,,,,,,,,0,1,Maison,77,4,S,sols,,,240,2.753178,50.266882
2020-869318,2020-01-27,000001,Vente,175000,2,,RUE LUCIE AUBRAC,0487,62217,62004,Achicourt,62,,,62004000BE0247,,,,,,,,,,,,,0,1,Maison,77,4,S,sols,,,259,2.753382,50.266818
2020-869360,2020-01-29,000001,Vente,23500,4,,RUE VICTOR HUGO,0670,62217,62004,Achicourt,62,,,62004000AT0184,,,,,,,,,,,,,0,3,Dépendance,,0,S,sols,,,378,2.755959,50.273146
2020-869372,2020-01-29,000001,Vente,169000,1,,RUE GERMAINE TILLION,0403,62217,62004,Achicourt,62,,,62004000AO0551,,,,,,,,,,,,,0,1,Maison,77,4,S,sols,,,238,2.752919,50.266727
2020-869374,2020-01-31,000001,Vente,174500,10,,RUE LUCIE AUBRAC,0487,62217,62004,Achicourt,62,,,62004000BE0252,,,,,,,,,,,,,0,1,Maison,77,4,S,sols,,,248,2.752578,50.267073
2020-869410,2020-01-28,000001,Vente,99650,,,RUE EMILE BASLY,0230,62217,62004,Achicourt,62,,,62004000AV0344,,,,,,,,,,,,,0,,,,,S,sols,,,50,2.759138,50.272769
2020-869410,2020-01-28,000001,Vente,99650,,,RUE EMILE BASLY,0230,62217,62004,Achicourt,62,,,62004000AV0346,,,,,,,,,,,,,0,,,,,S,sols,,,55,2.75899,50.272823
2020-869410,2020-01-28,000001,Vente,99650,11,,RUE EMILE BASLY,0230,62217,62004,Achicourt,62,,,62004000AV0347,,,,,,,,,,,,,0,1,Maison,89,3,S,sols,,,65,2.758918,50.272852
2020-869410,2020-01-28,000001,Vente,99650,,,RUE EMILE BASLY,0230,62217,62004,Achicourt,62,,,62004000AV0348,,,,,,,,,,,,,0,,,,,S,sols,,,68,2.758937,50.272772
2020-869505,2020-02-12,000001,Vente,18159,,,LE CHAMP DES QUATRE,B008,62217,62004,Achicourt,62,,,62004000ZA0002,,,,,,,,,,,,,0,,,,,T,terres,,,2933,2.738268,50.274228
2020-869505,2020-02-12,000001,Vente,18159,,,LE CHAMP DES QUATRE,B008,62217,62004,Achicourt,62,,,62004000ZA0003,,,,,,,,,,,,,0,,,,,T,terres,,,1090,2.738477,50.274136
2020-869505,2020-02-12,000001,Vente,18159,,,LE CHAMP DES QUATRE,B008,62217,62004,Achicourt,62,,,62004000ZA0004,,,,,,,,,,,,,0,,,,,T,terres,,,8083,2.738538,50.274416
2020-869533,2020-02-13,000001,Vente,243500,58,,RTE DE BUCQUOY,0080,62217,62004,Achicourt,62,,,62004000AX0512,,,,,,,,,,,,,0,1,Maison,26,2,S,sols,,,477,2.774184,50.277512
2020-869533,2020-02-13,000001,Vente,243500,58,,RTE DE BUCQUOY,0080,62217,62004,Achicourt,62,,,62004000AX0512,,,,,,,,,,,,,0,1,Maison,132,6,S,sols,,,477,2.774184,50.277512
2020-869565,2020-02-15,000001,Vente,154700,10,,AV D AMIENS,0013,62217,62004,Achicourt,62,,,62004000BB0307,,,,,,,,,,,,,0,1,Maison,94,5,S,sols,,,275,2.77374,50.266898
2020-869569,2020-02-08,000001,Vente,81500,37,,RUE FRANCOIS LAMBERT,0360,62217,62004,Achicourt,62,,,62004000AW0088,,,,,,,,,,,,,0,1,Maison,100,4,S,sols,,,262,2.76506,50.280128
2020-869577,2020-02-14,000001,Vente,71000,20,,IMP DE LA LIBERTE,0480,62217,62004,Achicourt,62,,,62004000AW0153,,,,,,,,,,,,,0,1,Maison,50,2,S,sols,,,51,2.768991,50.281076
2020-869591,2020-01-22,000001,Vente,189500,5,,RUE LA FONTAINE,0475,62217,62004,Achicourt,62,,,62004000AT0155,,,,,,,,,,,,,0,1,Maison,143,7,S,sols,,,540,2.75502,50.2746
2020-869591,2020-01-22,000001,Vente,189500,,,LA RUE DE FONTAINE,B061,62217,62004,Achicourt,62,,,62004000AT0156,,,,,,,,,,,,,0,,,,,S,sols,,,193,2.754915,50.274576
2020-869625,2020-02-21,000001,Vente,350000,,,LE TRIANGLE,B067,62217,62004,Achicourt,62,,,62004000AX0411,,,,,,,,,,,,,0,,,,,AB,terrains a bâtir,,,939,2.770163,50.277309
2020-869625,2020-02-21,000001,Vente,350000,9003,,RUE DES PLANQUETTES,0603,62217,62004,Achicourt,62,,,62004000AX0504,,,,,,,,,,,,,0,4,Local industriel. commercial ou assimilé,1690,0,S,sols,,,4162,2.770405,50.277542
2020-869649,2020-02-21,000001,Vente,45000,3,,RUE DE LISBONNE,0482,62217,62004,Achicourt,62,,,62004000AZ0866,,,,,,,,,,,,,0,,,,,S,sols,,,320,,
2020-869649,2020-02-21,000001,Vente,45000,,,RUE DE LISBONNE,0482,62217,62004,Achicourt,62,,,62004000AZ0868,,,,,,,,,,,,,0,,,,,S,sols,,,12,,
2020-869649,2020-02-21,000001,Vente,45000,,,RUE DE BELGRADE,0057,62217,62004,Achicourt,62,,,62004000AZ0870,,,,,,,,,,,,,0,,,,,S,sols,,,58,,
2020-869654,2020-02-19,000001,Vente,131800,68,,RUE PIERRE CURIE,0600,62217,62004,Achicourt,62,,,62004000AX0285,,,,,,,,,,,,,0,1,Maison,74,4,S,sols,,,643,2.770182,50.273242
2020-869686,2020-02-20,000001,Vente,167000,3,,RUE GERMAINE TILLION,0403,62217,62004,Achicourt,62,,,62004000AO0550,,,,,,,,,,,,,0,1,Maison,77,4,S,sols,,,237,2.75286,50.266639
2020-869735,2020-02-21,000001,Vente,104000,30,,RUE CHARLES FERRAND,0110,62217,62004,Achicourt,62,,,62004000AV0242,,,,,,,,,,,,,0,1,Maison,86,3,J,jardins,,,565,,
2020-869735,2020-02-21,000001,Vente,104000,30,,RUE CHARLES FERRAND,0110,62217,62004,Achicourt,62,,,62004000AV0242,,,,,,,,,,,,,0,1,Maison,86,3,S,sols,,,151,,
2020-869735,2020-02-21,000001,Vente,104000,,,RUE CHARLES FERRAND,0110,62217,62004,Achicourt,62,,,62004000AV0243,,,,,,,,,,,,,0,,,,,S,sols,,,44,2.763423,50.275295
2020-869750,2020-02-18,000001,Vente,184700,26,,RUE DE LYON,0491,62217,62004,Achicourt,62,,,62004000BB0015,,,,,,,,,,,,,0,1,Maison,97,5,S,sols,,,308,2.771086,50.270089
2020-869793,2020-03-04,000001,Vente,165000,5,,RUE GERMAINE TILLION,0403,62217,62004,Achicourt,62,,,62004000AO0549,,,,,,,,,,,,,0,1,Maison,77,4,S,sols,,,238,2.752791,50.266542
2020-869902,2020-03-10,000002,Vente,1600,,,LE CIMETIERE,B017,62217,62004,Achicourt,62,,,62004000AV0643,,,,,,,,,,,,,0,,,,,J,jardins,,,362,2.761805,50.275494
2020-869918,2020-03-03,000001,Vente,205000,29,,RUE FLORENT EVRARD,0330,62217,62004,Achicourt,62,,,62004000AX0088,,,,,,,,,,,,,0,1,Maison,140,4,S,sols,,,516,2.773345,50.278524
2020-869919,2020-03-04,000001,Vente,154000,17,,RUE DES ERABLES,0296,62217,62004,Achicourt,62,,,62004000BB0507,,,,,,,,,,,,,0,1,Maison,106,6,S,sols,,,361,2.767847,50.266722
2020-870028,2020-03-24,000001,Vente,137000,15,B,RUE ANATOLE FRANCE,0020,62217,62004,Achicourt,62,,,62004000AV0385,,,,,,,,,,,,,0,1,Maison,90,2,S,sols,,,246,2.758875,50.272138
2020-870049,2020-03-26,000001,Vente,165000,7,,RUE GERMAINE TILLION,0403,62217,62004,Achicourt,62,,,62004000AO0548,,,,,,,,,,,,,0,1,Maison,77,4,S,sols,,,247,2.752742,50.26645
2020-870094,2020-02-28,000001,Vente,92000,74,,RUE RAOUL BRIQUET,0610,62217,62004,Achicourt,62,,,62004000AV0059,,,,,,,,,,,,,0,1,Maison,103,3,S,sols,,,242,2.760466,50.27584
2020-870094,2020-02-28,000001,Vente,92000,,,LES MILANAIS,B041,62217,62004,Achicourt,62,,,62004000AV0063,,,,,,,,,,,,,0,,,,,J,jardins,,,500,2.759976,50.276041
2020-870112,2020-03-31,000001,Vente,169000,9,,RUE GERMAINE TILLION,0403,62217,62004,Achicourt,62,,,62004000AO0547,,,,,,,,,,,,,0,1,Maison,77,4,S,sols,,,259,2.75267,50.266365
2020-870113,2020-02-26,000001,Vente,150000,10,,RUE MICHEL SELAME,0560,62217,62004,Achicourt,62,,,62004000AV0318,,,,,,,,,,,,,0,1,Maison,105,4,S,sols,,,368,2.759524,50.273387
2020-870113,2020-02-26,000001,Vente,150000,10,,RUE MICHEL SELAME,0560,62217,62004,Achicourt,62,,,62004000AV0318,,,,,,,,,,,,,0,1,Maison,105,4,J,jardins,,,1122,2.759524,50.273387
2020-870134,2020-03-06,000001,Vente,123800,12,,RUE LUCIEN DISTINGHIN,0490,62217,62004,Achicourt,62,,,62004000AW0038,,,4,106.48,,,,,,,,,1,2,Appartement,104,4,,,,,,2.763298,50.278546
2020-870134,2020-03-06,000001,Vente,123800,12,,RUE LUCIEN DISTINGHIN,0490,62217,62004,Achicourt,62,,,62004000AW0038,,,7,,,,,,,,,,1,3,Dépendance,,0,,,,,,2.763298,50.278546
2020-870198,2020-04-08,000001,Vente,143650,16,,RUE DE BORDEAUX,0073,62217,62004,Achicourt,62,,,62004000BA0277,,,,,,,,,,,,,0,1,Maison,75,4,S,sols,,,276,2.773306,50.272478
2020-870198,2020-04-08,000001,Vente,143650,120,,RTE DE BUCQUOY,0080,62217,62004,Achicourt,62,,,62004000BA0304,,,,,,,,,,,,,0,,,,,J,jardins,,,128,2.773358,50.272294
2020-870204,2020-04-16,000001,Vente,138000,50,,RUE DE LONDRES,0485,62217,62004,Achicourt,62,,,62004000AZ0447,,,,,,,,,,,,,0,1,Maison,74,4,S,sols,,,403,2.777263,50.267869
2020-870282,2020-03-28,000001,Vente,147150,10,,PL DE FLERS DE L ORNE,0325,62217,62004,Achicourt,62,,,62004000BA0162,,,12,115.03,,,,,,,,,1,2,Appartement,115,5,,,,,,2.771846,50.271266
2020-870417,2020-05-07,000001,Vente,188000,10,,RUE DE BANGUI,0049,62217,62004,Achicourt,62,,,62004000AZ0322,,,,,,,,,,,,,0,1,Maison,102,5,S,sols,,,232,2.776672,50.270619
2020-870436,2020-04-14,000001,Vente,132000,10,,RUE ANATOLE FRANCE,0020,62217,62004,Achicourt,62,,,62004000BD0091,,,,,,,,,,,,,0,1,Maison,99,3,S,sols,,,376,2.757589,50.272505
2020-870468,2020-04-25,000001,Vente,130000,12,,RUE DE GRENOBLE,0407,62217,62004,Achicourt,62,,,62004000BA0074,,,,,,,,,,,,,0,1,Maison,84,5,S,sols,,,264,2.773493,50.270957
2020-870640,2020-04-24,000001,Vente,226950,2,,RUE EMILE BASLY,0230,62217,62004,Achicourt,62,,,62004000AV0361,,,,,,,,,,,,,0,1,Maison,70,3,S,sols,,,140,2.759049,50.273598
2020-870640,2020-04-24,000001,Vente,226950,5,B,RUE MICHEL SELAME,0560,62217,62004,Achicourt,62,,,62004000AV0533,,,,,,,,,,,,,0,3,Dépendance,,0,S,sols,,,41,2.759107,50.273782
2020-870675,2020-05-07,000001,Vente,150000,45,,RUE DE LAON,0463,62217,62004,Achicourt,62,,,62004000BB0223,,,,,,,,,,,,,0,1,Maison,95,4,S,sols,,,281,2.77251,50.267466
2020-870676,2020-05-12,000001,Vente,110000,54,,RUE ROGER SALENGRO,0640,62217,62004,Achicourt,62,,,62004000AW0463,,,,,,,,,,,,,0,1,Maison,98,5,S,sols,,,373,2.764923,50.279563
2020-870678,2020-05-23,000001,Vente,222000,,,LES LAINES,B040,62217,62004,Achicourt,62,,,62004000BD0202,,,,,,,,,,,,,0,,,,,J,jardins,,,848,2.759986,50.268747
2020-870678,2020-05-23,000001,Vente,222000,88,,RUE MARCEL DELIS,0500,62217,62004,Achicourt,62,,,62004000BD0203,,,,,,,,,,,,,0,1,Maison,146,4,S,sols,,,375,2.760474,50.268602
2020-870751,2020-06-02,000001,Vente,102600,45,,RUE ETIENNE DOLET,0310,62217,62004,Achicourt,62,,,62004000AV0422,,,,,,,,,,,,,0,1,Maison,83,3,S,sols,,,454,2.761564,50.272125
2020-870754,2020-05-15,000001,Vente,212400,11,,RUE JC D'HONDT,0429,62217,62004,Achicourt,62,,,62004000BC0419,,,,,,,,,,,,,0,1,Maison,129,5,S,sols,,,261,2.762539,50.268241
2020-870789,2020-05-07,000001,Vente,124000,16,,RUE PIERRE CURIE,0600,62217,62004,Achicourt,62,,,62004000AX0227,,,,,,,,,,,,,0,1,Maison,60,3,S,sols,,,270,2.773533,50.274111
2020-870802,2020-05-15,000001,Vente,123500,9,,RUE ETIENNE DOLET,0310,62217,62004,Achicourt,62,,,62004000AV0488,,,,,,,,,,,,,0,1,Maison,70,4,S,sols,,,113,2.762904,50.273869
2020-870802,2020-05-15,000001,Vente,123500,9,,RUE ETIENNE DOLET,0310,62217,62004,Achicourt,62,,,62004000AV0489,,,,,,,,,,,,,0,,,,,S,sols,,,83,2.762925,50.273909
2020-870808,2020-05-18,000001,Vente,173500,6,,RUE LUCIE AUBRAC,0487,62217,62004,Achicourt,62,,,62004000BE0249,,,,,,,,,,,,,0,1,Maison,77,4,S,sols,,,115,2.753031,50.266937
2020-870808,2020-05-18,000001,Vente,173500,6,,RUE LUCIE AUBRAC,0487,62217,62004,Achicourt,62,,,62004000BE0250,,,,,,,,,,,,,0,,,,,S,sols,,,127,2.752929,50.266967
2020-870838,2020-05-20,000001,Vente,119000,12,,RUE DE TOULOUSE,0647,62217,62004,Achicourt,62,,,62004000BA0191,,,,,,,,,,,,,0,1,Maison,84,5,S,sols,,,226,2.770702,50.272256
2020-870894,2020-05-23,000001,Vente,183000,4,,RUE DES BOULEAUX,0072,62217,62004,Achicourt,62,,,62004000BB0512,,,,,,,,,,,,,0,1,Maison,88,3,S,sols,,,700,2.767332,50.266214
2020-870914,2020-06-11,000001,Vente,1600,,,LE CIMETIERE,B017,62217,62004,Achicourt,62,,,62004000AV0251,,,,,,,,,,,,,0,,,,,J,jardins,,,145,2.762732,50.274938
2020-870914,2020-06-11,000001,Vente,1600,,,LE CIMETIERE,B017,62217,62004,Achicourt,62,,,62004000AV0252,,,,,,,,,,,,,0,,,,,J,jardins,,,113,2.762581,50.275023
2020-870914,2020-06-11,000001,Vente,1600,,,LE CIMETIERE,B017,62217,62004,Achicourt,62,,,62004000AV0644,,,,,,,,,,,,,0,,,,,J,jardins,,,335,2.762274,50.275195
2020-870955,2020-06-12,000001,Vente,317000,40,,RUE PASTEUR,0570,62217,62004,Achicourt,62,,,62004000BE0221,,,,,,,,,,,,,0,1,Maison,120,5,S,sols,,,750,2.754743,50.270191
2020-870955,2020-06-12,000001,Vente,317000,,,LES HAIES,B034,62217,62004,Achicourt,62,,,62004000BE0225,,,,,,,,,,,,,0,,,,,J,jardins,,,61,2.754512,50.27035
2020-870955,2020-06-12,000001,Vente,317000,38,,RUE PASTEUR,0570,62217,62004,Achicourt,62,,,62004000BE0228,,,,,,,,,,,,,0,,,,,J,jardins,,,36,2.754507,50.270383
2020-870976,2020-06-12,000001,Vente,170000,14,,PL DE FLERS DE L ORNE,0325,62217,62004,Achicourt,62,,,62004000BA0162,,,14,,21,,,,,,,,2,2,Appartement,87,4,,,,,,2.771846,50.271266
2020-871051,2020-06-17,000001,Vente,185000,104,,RTE DE BAPAUME,0050,62217,62004,Achicourt,62,,,62004000AY0084,,,,,,,,,,,,,0,1,Maison,70,5,S,sols,,,467,2.783082,50.273668
2020-871214,2020-06-26,000001,Vente,85900,5,,RUE EDMOND ROBAERT,0200,62217,62004,Achicourt,62,,,62004000AY0156,,,,,,,,,,,,,0,1,Maison,84,4,S,sols,,,749,2.78215,50.271569
2020-871221,2020-06-16,000001,Vente,141500,56,,RUE DE LYON,0491,62217,62004,Achicourt,62,,,62004000BB0148,,,,,,,,,,,,,0,1,Maison,96,4,S,sols,,,409,2.773165,50.268894
2020-871309,2020-06-30,000001,Vente,196000,11,,RTE DE BUCQUOY,0080,62217,62004,Achicourt,62,,,62004000AZ0005,,,,,,,,,,,,,0,1,Maison,125,6,S,sols,,,430,2.775183,50.274072
2020-871309,2020-06-30,000001,Vente,196000,2,,RUE EDMOND SOUART,0210,62217,62004,Achicourt,62,,,62004000AZ0714,,,,,,,,,,,,,0,,,,,S,sols,,,18,2.775694,50.273815
2020-871309,2020-06-30,000001,Vente,196000,2,,RUE EDMOND SOUART,0210,62217,62004,Achicourt,62,,,62004000AZ0715,,,,,,,,,,,,,0,,,,,S,sols,,,4,2.775746,50.273876
2020-871382,2020-06-04,000001,Vente,65000,107,,RUE RAOUL BRIQUET,0610,62217,62004,Achicourt,62,,,62004000BD0072,,,,,,,,,,,,,0,4,Local industriel. commercial ou assimilé,482,0,S,sols,,,426,2.756785,50.272944
2020-871389,2020-06-23,000001,Vente,190000,32,,RUE DE LAON,0463,62217,62004,Achicourt,62,,,62004000BB0250,,,,,,,,,,,,,0,1,Maison,107,6,S,sols,,,390,2.768983,50.268844
2020-871435,2020-07-01,000001,Vente,194000,19,,RTE DE BUCQUOY,0080,62217,62004,Achicourt,62,,,62004000AZ0812,,,,,,,,,,,,,0,1,Maison,116,6,S,sols,,,318,2.775104,50.273397
2020-871459,2020-07-02,000001,Vente,152500,20,,RUE MAURICE SERGEANT,0550,62217,62004,Achicourt,62,,,62004000AX0119,,,,,,,,,,,,,0,1,Maison,131,3,S,sols,,,456,2.77334,50.276349
2020-871622,2020-07-02,000001,Vente,204400,15,,RUE DE LONDRES,0485,62217,62004,Achicourt,62,,,62004000AZ0405,,,,,,,,,,,,,0,1,Maison,80,5,S,sols,,,470,2.776412,50.269752
2020-871634,2020-07-22,000001,Vente,159500,15,,RUE FRANCOIS LAMBERT,0360,62217,62004,Achicourt,62,,,62004000AW0115,,,,,,,,,,,,,0,1,Maison,98,4,S,sols,,,508,2.766468,50.281128
2020-871718,2020-07-17,000001,Vente,9804,,,LE BELLOY,B004,62217,62004,Achicourt,62,,,62004000AT0014,,,,,,,,,,,,,0,,,,,T,terres,,,1681,2.751409,50.277273
2020-871718,2020-07-17,000001,Vente,9804,,,LE BELLOY,B004,62217,62004,Achicourt,62,,,62004000AT0015,,,,,,,,,,,,,0,,,,,T,terres,,,4554,2.75133,50.277035
2020-871725,2020-07-10,000001,Vente,97000,104,,RUE MARCEL DELIS,0500,62217,62004,Achicourt,62,,,62004000BD0175,,,,,,,,,,,,,0,1,Maison,71,4,S,sols,,,450,2.760044,50.266777
2020-871742,2020-07-21,000001,Vente,132650,18,,RUE DE BREST,0074,62217,62004,Achicourt,62,,,62004000BA0089,,,,,,,,,,,,,0,1,Maison,84,5,S,sols,,,281,2.773673,50.270403
2020-871747,2020-07-11,000001,Vente,111700,14,,RUE DES PLATANES,0604,62217,62004,Achicourt,62,,,62004000BB0429,,,,,,,,,,,,,0,1,Maison,110,5,S,sols,,,300,2.770713,50.265994
2020-871832,2020-08-01,000001,Vente,183000,7,,RUE DU CAUMONT,0095,62217,62004,Achicourt,62,,,62004000AX0462,,,,,,,,,,,,,0,1,Maison,114,4,S,sols,,,397,2.771659,50.275834
2020-871832,2020-08-01,000001,Vente,183000,,,LE MOULIN HACART,B043,62217,62004,Achicourt,62,,,62004000AX0467,,,,,,,,,,,,,0,,,,,S,sols,,,269,2.771657,50.275849
2020-871874,2020-07-17,000001,Vente,83000,4,,RUE GEORGES LOUCHET,0400,62217,62004,Achicourt,62,,,62004000AY0223,,,,,,,,,,,,,0,1,Maison,94,5,S,sols,,,579,2.780299,50.274946
2020-871911,2020-07-06,000001,Vente,715000,7,,RUE PASCAL,0565,62217,62004,Achicourt,62,,,62004000AX0569,,,,,,,,,,,,,0,4,Local industriel. commercial ou assimilé,950,0,S,sols,,,2778,2.766987,50.273101
2020-871944,2020-07-31,000001,Vente,180000,126,,RTE DE BAPAUME,0050,62217,62004,Achicourt,62,,,62004000AY0114,,,,,,,,,,,,,0,2,Appartement,30,1,S,sols,,,151,2.783643,50.272897
2020-871944,2020-07-31,000001,Vente,180000,126,,RTE DE BAPAUME,0050,62217,62004,Achicourt,62,,,62004000AY0114,,,,,,,,,,,,,0,3,Dépendance,,0,S,sols,,,151,2.783643,50.272897
2020-871944,2020-07-31,000001,Vente,180000,126,,RTE DE BAPAUME,0050,62217,62004,Achicourt,62,,,62004000AY0114,,,,,,,,,,,,,0,3,Dépendance,,0,S,sols,,,151,2.783643,50.272897
2020-871944,2020-07-31,000001,Vente,180000,126,,RTE DE BAPAUME,0050,62217,62004,Achicourt,62,,,62004000AY0114,,,,,,,,,,,,,0,2,Appartement,64,4,S,sols,,,151,2.783643,50.272897
2020-871944,2020-07-31,000001,Vente,180000,126,,RTE DE BAPAUME,0050,62217,62004,Achicourt,62,,,62004000AY0114,,,,,,,,,,,,,0,3,Dépendance,,0,S,sols,,,151,2.783643,50.272897
2020-871944,2020-07-31,000001,Vente,180000,126,,RTE DE BAPAUME,0050,62217,62004,Achicourt,62,,,62004000AY0114,,,,,,,,,,,,,0,2,Appartement,60,3,S,sols,,,151,2.783643,50.272897
2020-871944,2020-07-31,000001,Vente,180000,126,,RTE DE BAPAUME,0050,62217,62004,Achicourt,62,,,62004000AY0114,,,,,,,,,,,,,0,2,Appartement,20,1,S,sols,,,151,2.783643,50.272897
2020-871944,2020-07-31,000001,Vente,180000,126,,RTE DE BAPAUME,0050,62217,62004,Achicourt,62,,,62004000AY0114,,,,,,,,,,,,,0,3,Dépendance,,0,S,sols,,,151,2.783643,50.272897
2020-871944,2020-07-31,000001,Vente,180000,,,LE PETIT BAPAUME NORD,B073,62217,62004,Achicourt,62,,,62004000AY0115,,,,,,,,,,,,,0,,,,,J,jardins,,,447,2.783375,50.272788
2020-871944,2020-07-31,000001,Vente,180000,,,LE PETIT BAPAUME NORD,B073,62217,62004,Achicourt,62,,,62004000AY0115,,,,,,,,,,,,,0,,,,,S,sols,,,17,2.783375,50.272788
2020-871950,2020-07-31,000001,Vente,200000,15,,RUE DE BELGRADE,0057,62217,62004,Achicourt,62,,,62004000AZ0218,,,,,,,,,,,,,0,1,Maison,117,6,S,sols,,,437,2.775708,50.271336
2020-871959,2020-08-18,000001,Vente,50000,1,,RUE RAYMOND SOUILLIART,0620,62217,62004,Achicourt,62,,,62004000AV0015,,,2,,,,,,,,,,1,2,Appartement,40,2,,,,,,2.762029,50.276727
2020-871959,2020-08-18,000001,Vente,50000,1,,RUE RAYMOND SOUILLIART,0620,62217,62004,Achicourt,62,,,62004000AV0015,,,13,,,,,,,,,,1,3,Dépendance,,0,,,,,,2.762029,50.276727
2020-871993,2020-08-14,000001,Vente,108000,31,,RUE MAURICE SERGEANT,0550,62217,62004,Achicourt,62,,,62004000AX0238,,,,,,,,,,,,,0,1,Maison,66,5,S,sols,,,494,2.771719,50.276129
2020-871995,2020-08-11,000001,Vente,130900,5,,RUE DE MOULINS,0561,62217,62004,Achicourt,62,,,62004000BA0160,,,,,,,,,,,,,0,1,Maison,74,4,S,sols,,,275,2.771152,50.270779
2020-871998,2020-07-09,000001,Vente,160000,21,,RUE DE LONDRES,0485,62217,62004,Achicourt,62,,,62004000AZ0360,,,,,,,,,,,,,0,1,Maison,65,4,S,sols,,,673,2.777333,50.26993
2020-872111,2020-08-13,000001,Vente,190000,8,,RUE DES PLATANES,0604,62217,62004,Achicourt,62,,,62004000BB0432,,,,,,,,,,,,,0,1,Maison,110,5,S,sols,,,327,2.771215,50.26584
2020-872116,2020-08-24,000001,Vente,714000,11,,RUE DES PLANQUETTES,0603,62217,62004,Achicourt,62,,,62004000AX0011,,,,,,,,,,,,,0,4,Local industriel. commercial ou assimilé,,,S,sols,,,5900,,
2020-872116,2020-08-24,000001,Vente,714000,,,LE TRIANGLE,B067,62217,62004,Achicourt,62,,,62004000AX0012,,,,,,,,,,,,,0,,,,,S,sols,,,1085,2.770598,50.279089
2020-872186,2020-08-28,000001,Vente,110000,20,,PL DE FLERS DE L ORNE,0325,62217,62004,Achicourt,62,,,62004000BA0162,,,17,62.47,24,,,,,,,,2,2,Appartement,57,3,,,,,,2.771846,50.271266
2020-872189,2020-08-21,000001,Vente,245290,12,,RUE DU MOULIN HACART,0559,62217,62004,Achicourt,62,,,62004000AX0437,,,,,,,,,,,,,0,1,Maison,103,4,S,sols,,,1069,2.771538,50.277643
2020-872203,2020-08-29,000001,Vente,294500,40,,RUE PASTEUR,0570,62217,62004,Achicourt,62,,,62004000BE0222,,,,,,,,,,,,,0,,,,,S,sols,,,66,2.754873,50.270279
2020-872203,2020-08-29,000001,Vente,294500,,,LES HAIES,B034,62217,62004,Achicourt,62,,,62004000BE0224,,,,,,,,,,,,,0,,,,,J,jardins,,,210,2.754059,50.270504
2020-872203,2020-08-29,000001,Vente,294500,38,,RUE PASTEUR,0570,62217,62004,Achicourt,62,,,62004000BE0226,,,,,,,,,,,,,0,1,Maison,122,5,J,jardins,,,1673,2.754653,50.270497
2020-872203,2020-08-29,000001,Vente,294500,38,,RUE PASTEUR,0570,62217,62004,Achicourt,62,,,62004000BE0226,,,,,,,,,,,,,0,1,Maison,122,5,S,sols,,,1000,2.754653,50.270497
2020-872215,2020-09-04,000001,Vente,225000,69,,RUE RAOUL BRIQUET,0610,62217,62004,Achicourt,62,,,62004000AV0176,,,,,,,,,,,,,0,1,Maison,80,4,S,sols,,,1211,2.760078,50.27517
2020-872215,2020-09-04,000001,Vente,225000,,,LES FOSSES,B031,62217,62004,Achicourt,62,,,62004000AV0177,,,,,,,,,,,,,0,,,,,S,sols,,,624,2.760605,50.27474
2020-872282,2020-09-03,000001,Vente,203400,12,,RTE DE BAPAUME,0050,62217,62004,Achicourt,62,,,62004000AY0028,,,,,,,,,,,,,0,4,Local industriel. commercial ou assimilé,38,0,S,sols,,,250,2.781704,50.277665
2020-872282,2020-09-03,000001,Vente,203400,12,,RTE DE BAPAUME,0050,62217,62004,Achicourt,62,,,62004000AY0028,,,,,,,,,,,,,0,2,Appartement,59,2,S,sols,,,250,2.781704,50.277665
2020-872282,2020-09-03,000001,Vente,203400,12,,RTE DE BAPAUME,0050,62217,62004,Achicourt,62,,,62004000AY0028,,,,,,,,,,,,,0,2,Appartement,60,3,S,sols,,,250,2.781704,50.277665
2020-872282,2020-09-03,000001,Vente,203400,,,RTE DE BAPAUME,0050,62217,62004,Achicourt,62,,,62004000AY0337,,,,,,,,,,,,,0,,,,,S,sols,,,392,2.781187,50.277476
2020-872306,2020-08-26,000001,Vente,181000,74,,RTE DE BUCQUOY,0080,62217,62004,Achicourt,62,,,62004000AX0129,,,,,,,,,,,,,0,1,Maison,80,5,S,sols,,,253,2.77425,50.276252
2020-872324,2020-09-05,000001,Vente,160000,21,,RUE ROGER SALENGRO,0640,62217,62004,Achicourt,62,,,62004000AW0176,,,,,,,,,,,,,0,1,Maison,65,4,J,jardins,,,1066,2.76759,50.280453
2020-872324,2020-09-05,000001,Vente,160000,21,,RUE ROGER SALENGRO,0640,62217,62004,Achicourt,62,,,62004000AW0176,,,,,,,,,,,,,0,1,Maison,65,4,S,sols,,,375,2.76759,50.280453
2020-872331,2020-09-12,000001,Vente,173735,110,,RUE DE LAON,0463,62217,62004,Achicourt,62,,,62004000BB0315,,,,,,,,,,,,,0,1,Maison,83,4,S,sols,,,374,2.773107,50.266118