id_mutation,date_mutation,numero_disposition,nature_mutation,valeur_fonciere,adresse_numero,adresse_suffixe,adresse_nom_voie,adresse_code_voie,code_postal,code_commune,nom_commune,code_departement,ancien_code_commune,ancien_nom_commune,id_parcelle,ancien_id_parcelle,numero_volume,lot1_numero,lot1_surface_carrez,lot2_numero,lot2_surface_carrez,lot3_numero,lot3_surface_carrez,lot4_numero,lot4_surface_carrez,lot5_numero,lot5_surface_carrez,nombre_lots,code_type_local,type_local,surface_reelle_bati,nombre_pieces_principales,code_nature_culture,nature_culture,code_nature_culture_speciale,nature_culture_speciale,surface_terrain,longitude,latitude
2020-892951,2020-02-20,000001,Vente,130000,14,,RTE DE SAINT OMER,0045,62850,62024,Alquines,62,,,620240000B0137,,,,,,,,,,,,,0,1,Maison,89,3,S,sols,,,1495,2.027895,50.752638
2020-892951,2020-02-20,000001,Vente,130000,,,HAM DE NEUVILLE,B030,62850,62024,Alquines,62,,,620240000B0138,,,,,,,,,,,,,0,,,,,J,jardins,,,565,2.027619,50.752575
2020-892951,2020-02-20,000001,Vente,130000,,,HAM DE NEUVILLE,B030,62850,62024,Alquines,62,,,620240000B0139,,,,,,,,,,,,,0,,,,,P,prés,,,5220,2.027473,50.752044
2020-892951,2020-02-20,000001,Vente,130000,,,HAM DE NEUVILLE,B030,62850,62024,Alquines,62,,,620240000B0799,,,,,,,,,,,,,0,,,,,S,sols,,,687,2.027858,50.752872
2020-893147,2020-03-12,000001,Vente,35000,,,RUE DE LA PYRAMIDE,0042,62850,62024,Alquines,62,,,620240000C0952,,,,,,,,,,,,,0,,,,,AG,terrains d'agrément,,,521,1.98617,50.718765
2020-893147,2020-03-12,000001,Vente,35000,,,RUE DE LA PYRAMIDE,0042,62850,62024,Alquines,62,,,620240000C0952,,,,,,,,,,,,,0,,,,,AB,terrains a bâtir,,,1000,1.98617,50.718765
2020-893515,2020-06-03,000001,Vente,140000,20,B,RUE DE LA PYRAMIDE,0042,62850,62024,Alquines,62,,,620240000C0831,,,,,,,,,,,,,0,1,Maison,97,4,S,sols,,,1000,1.985083,50.717523
2020-893515,2020-06-03,000001,Vente,140000,20,B,RUE DE LA PYRAMIDE,0042,62850,62024,Alquines,62,,,620240000C0831,,,,,,,,,,,,,0,1,Maison,97,4,AG,terrains d'agrément,,,100,1.985083,50.717523
2020-893515,2020-06-03,000001,Vente,140000,,,FERME DE FROMENTEL,B022,62850,62024,Alquines,62,,,620240000C0843,,,,,,,,,,,,,0,,,,,AG,terrains d'agrément,,,366,1.985027,50.717872
2020-894549,2020-09-09,000001,Vente,3800,,,LE VILLAGE,B055,62850,62024,Alquines,62,,,620240000A0857,,,,,,,,,,,,,0,,,,,S,sols,,,76,1.990988,50.743799
2020-894752,2020-09-28,000002,Vente,190000,,,LE VILLAGE,B055,62850,62024,Alquines,62,,,620240000A0435,,,,,,,,,,,,,0,,,,,P,prés,,,1280,1.99342,50.742237
2020-894752,2020-09-28,000002,Vente,190000,,,LE VILLAGE,B055,62850,62024,Alquines,62,,,620240000A0437,,,,,,,,,,,,,0,,,,,P,prés,,,2080,1.992914,50.742251
2020-894752,2020-09-28,000002,Vente,190000,8,,RUE DES VICTIMES DE GUERRE,0060,62850,62024,Alquines,62,,,620240000A0859,,,,,,,,,,,,,0,1,Maison,40,1,S,sols,,,2536,1.992518,50.74209
2020-894752,2020-09-28,000002,Vente,190000,8,,RUE DES VICTIMES DE GUERRE,0060,62850,62024,Alquines,62,,,620240000A0859,,,,,,,,,,,,,0,1,Maison,128,4,S,sols,,,2536,1.992518,50.74209
2020-895185,2020-11-24,000001,Vente,24200,,,VAL DE HTE PLANQUE,B051,62850,62024,Alquines,62,,,62024000ZA0055,,,,,,,,,,,,,0,,,,,T,terres,,,6942,1.978413,50.732794
2020-895315,2020-11-16,000001,Vente,145000,14,,RUE G ET E ROCOURT,0025,62850,62024,Alquines,62,,,620240000A0672,,,,,,,,,,,,,0,1,Maison,50,3,S,sols,,,295,1.991403,50.740247
2020-895315,2020-11-16,000001,Vente,145000,12,,RUE G ET E ROCOURT,0025,62850,62024,Alquines,62,,,620240000A0789,,,,,,,,,,,,,0,1,Maison,25,1,S,sols,,,1270,1.991395,50.740391
2020-895315,2020-11-16,000001,Vente,145000,12,,RUE G ET E ROCOURT,0025,62850,62024,Alquines,62,,,620240000A0789,,,,,,,,,,,,,0,4,Local industriel. commercial ou assimilé,420,0,S,sols,,,1270,1.991395,50.740391
2020-895397,2020-12-16,000001,Vente,224250,5001,F,RUE DE LA HAUTE PLANQUE,0041,62850,62024,Alquines,62,,,620240000A0539,,,,,,,,,,,,,0,1,Maison,97,2,S,sols,,,811,1.986793,50.739224
2020-895397,2020-12-16,000001,Vente,224250,5001,F,RUE DE LA HAUTE PLANQUE,0041,62850,62024,Alquines,62,,,620240000A0539,,,,,,,,,,,,,0,1,Maison,97,2,AG,terrains d'agrément,,,1659,1.986793,50.739224
2020-895562,2020-12-29,000001,Vente,260000,,,HAM DU BUISSON,B031,62850,62024,Alquines,62,,,620240000B0424,,,,,,,,,,,,,0,,,,,P,prés,,,9940,2.012125,50.73999
2020-895562,2020-12-29,000001,Vente,260000,,,HAM DU BUISSON,B031,62850,62024,Alquines,62,,,620240000B0425,,,,,,,,,,,,,0,,,,,P,prés,,,900,2.011274,50.739786
2020-895562,2020-12-29,000001,Vente,260000,5,,RUE DU MONT BREUCHET,0006,62850,62024,Alquines,62,,,620240000B0427,,,,,,,,,,,,,0,1,Maison,62,7,S,sols,,,1165,2.009601,50.740304
2020-895562,2020-12-29,000001,Vente,260000,5,,RUE DU MONT BREUCHET,0006,62850,62024,Alquines,62,,,620240000B0427,,,,,,,,,,,,,0,1,Maison,118,5,S,sols,,,1165,2.009601,50.740304
2020-895562,2020-12-29,000001,Vente,260000,,,DERRIERE LE BUISSON,B018,62850,62024,Alquines,62,,,620240000B0502,,,,,,,,,,,,,0,,,,,P,prés,,,2610,2.013282,50.739553
2020-895562,2020-12-29,000001,Vente,260000,,,DERRIERE LE BUISSON,B018,62850,62024,Alquines,62,,,620240000B0503,,,,,,,,,,,,,0,,,,,P,prés,,,2550,2.013134,50.739089
2020-895562,2020-12-29,000001,Vente,260000,,,HAM DU BUISSON,B031,62850,62024,Alquines,62,,,620240000B0843,,,,,,,,,,,,,0,,,,,P,prés,,,5199,2.010029,50.740292
