id_mutation,date_mutation,numero_disposition,nature_mutation,valeur_fonciere,adresse_numero,adresse_suffixe,adresse_nom_voie,adresse_code_voie,code_postal,code_commune,nom_commune,code_departement,ancien_code_commune,ancien_nom_commune,id_parcelle,ancien_id_parcelle,numero_volume,lot1_numero,lot1_surface_carrez,lot2_numero,lot2_surface_carrez,lot3_numero,lot3_surface_carrez,lot4_numero,lot4_surface_carrez,lot5_numero,lot5_surface_carrez,nombre_lots,code_type_local,type_local,surface_reelle_bati,nombre_pieces_principales,code_nature_culture,nature_culture,code_nature_culture_speciale,nature_culture_speciale,surface_terrain,longitude,latitude
2020-869953,2020-02-20,000001,Vente,140000,,,LE VILLAGE,B022,62134,62342,Fontaine-lès-Boulans,62,,,623420000B0045,,,,,,,,,,,,,0,,,,,J,jardins,,,1045,2.275955,50.495352
2020-869953,2020-02-20,000001,Vente,140000,14,,RUE PRINCIPALE,0150,62134,62342,Fontaine-lès-Boulans,62,,,623420000B0460,,,,,,,,,,,,,0,1,Maison,163,6,S,sols,,,1370,2.275658,50.49544
2020-871127,2020-05-23,000002,Vente,55000,,,LE VILLAGE,B022,62134,62342,Fontaine-lès-Boulans,62,,,623420000B0029,,,,,,,,,,,,,0,,,,,P,prés,,,2291,2.275411,50.492725
2020-871127,2020-05-23,000002,Vente,55000,,,LE VILLAGE,B022,62134,62342,Fontaine-lès-Boulans,62,,,623420000B0029,,,,,,,,,,,,,0,,,,,S,sols,,,1424,2.275411,50.492725
2020-871127,2020-05-23,000002,Vente,55000,,,LE VILLAGE,B022,62134,62342,Fontaine-lès-Boulans,62,,,623420000B0030,,,,,,,,,,,,,0,,,,,J,jardins,,,675,2.275457,50.492908
2020-871127,2020-05-23,000002,Vente,55000,,,LE VILLAGE,B022,62134,62342,Fontaine-lès-Boulans,62,,,623420000B0031,,,,,,,,,,,,,0,,,,,T,terres,,,1176,2.275997,50.492832
2020-871127,2020-05-23,000002,Vente,55000,,,LE VILLAGE,B022,62134,62342,Fontaine-lès-Boulans,62,,,623420000B0465,,,,,,,,,,,,,0,,,,,S,sols,,,35,2.274758,50.492776
2020-871764,2020-08-04,000001,Vente,1555,,,LES VINGT DEUX,B023,62134,62342,Fontaine-lès-Boulans,62,,,62342000ZB0006,,,,,,,,,,,,,0,,,,,T,terres,,,2822,2.27273,50.50912
