id_mutation,date_mutation,numero_disposition,nature_mutation,valeur_fonciere,adresse_numero,adresse_suffixe,adresse_nom_voie,adresse_code_voie,code_postal,code_commune,nom_commune,code_departement,ancien_code_commune,ancien_nom_commune,id_parcelle,ancien_id_parcelle,numero_volume,lot1_numero,lot1_surface_carrez,lot2_numero,lot2_surface_carrez,lot3_numero,lot3_surface_carrez,lot4_numero,lot4_surface_carrez,lot5_numero,lot5_surface_carrez,nombre_lots,code_type_local,type_local,surface_reelle_bati,nombre_pieces_principales,code_nature_culture,nature_culture,code_nature_culture_speciale,nature_culture_speciale,surface_terrain,longitude,latitude
2020-874889,2020-01-03,000001,Vente,232950,66,,RUE DES ANGLAIS,0010,62232,62454,Hinges,62,,,62454000AC0069,,,,,,,,,,,,,0,1,Maison,113,4,S,sols,,,893,2.630728,50.583928
2020-874907,2020-01-14,000001,Vente,73100,,,LES MONTANTS DU MOULIN,B028,62232,62454,Hinges,62,,,62454000AP0112,,,,,,,,,,,,,0,,,,,AB,terrains a bâtir,,,670,2.616629,50.556878
2020-874910,2020-01-15,000001,Vente,60000,,,LES FLAQUES,B018,62232,62454,Hinges,62,,,62454000AA0082,,,,,,,,,,,,,0,,,,,S,sols,,,29,2.634944,50.591245
2020-874910,2020-01-15,000001,Vente,60000,,,LES FLAQUES,B018,62232,62454,Hinges,62,,,62454000AA0083,,,,,,,,,,,,,0,,,,,AB,terrains a bâtir,,,804,2.634866,50.591442
2020-874932,2020-01-21,000001,Vente,1175.6,,,LA MAISON DUQUESNES,B025,62232,62454,Hinges,62,,,62454000AE0064,,,,,,,,,,,,,0,,,,,T,terres,,,2939,2.63508,50.582874
2020-874934,2020-01-16,000001,Vente,135500,218,,RUE DU PLOUY,0360,62232,62454,Hinges,62,,,62454000AN0091,,,,,,,,,,,,,0,1,Maison,89,5,J,jardins,,,685,2.62747,50.563239
2020-874934,2020-01-16,000001,Vente,135500,218,,RUE DU PLOUY,0360,62232,62454,Hinges,62,,,62454000AN0091,,,,,,,,,,,,,0,1,Maison,89,5,S,sols,,,457,2.62747,50.563239
2020-874991,2020-01-24,000001,Vente,170000,283,,RUE DU RIETZ,0374,62232,62454,Hinges,62,,,62454000AD0035,,,,,,,,,,,,,0,1,Maison,90,5,S,sols,,,319,2.623889,50.581983
2020-874991,2020-01-24,000001,Vente,170000,283,,RUE DU RIETZ,0374,62232,62454,Hinges,62,,,62454000AD0035,,,,,,,,,,,,,0,1,Maison,90,5,J,jardins,,,1958,2.623889,50.581983
2020-875040,2020-01-14,000001,Vente,89000,,,LA COBARDERIE,B011,62232,62454,Hinges,62,,,62454000AC0101,,,,,,,,,,,,,0,,,,,T,terres,,,2584,2.628427,50.583347
2020-875040,2020-01-14,000001,Vente,89000,,,LA COBARDERIE,B011,62232,62454,Hinges,62,,,62454000AC0101,,,,,,,,,,,,,0,,,,,AB,terrains a bâtir,,,1000,2.628427,50.583347
2020-875113,2020-01-31,000001,Vente,77700,,,LES MONTANTS DU MOULIN,B028,62232,62454,Hinges,62,,,62454000AP0117,,,,,,,,,,,,,0,,,,,AB,terrains a bâtir,,,810,2.616929,50.556561
2020-875753,2020-03-09,000001,Vente,193300,457,,RUE DE LA JANDRIE,0193,62232,62454,Hinges,62,,,62454000AO0056,,,,,,,,,,,,,0,1,Maison,133,5,AG,terrains d'agrément,,,1090,2.624091,50.558592
2020-875753,2020-03-09,000001,Vente,193300,457,,RUE DE LA JANDRIE,0193,62232,62454,Hinges,62,,,62454000AO0056,,,,,,,,,,,,,0,1,Maison,133,5,S,sols,,,376,2.624091,50.558592
2020-875797,2020-03-13,000001,Vente,165500,1010,,RUE DE BETHUNE,0040,62232,62454,Hinges,62,,,62454000AP0076,,,,,,,,,,,,,0,1,Maison,99,5,S,sols,,,437,2.617586,50.555913
2020-875816,2020-04-23,000001,Vente,80000,,,RTE DE MERVILLE,0260,62232,62454,Hinges,62,,,62454000AS0123,,,,,,,,,,,,,0,,,,,S,sols,,,196,2.62123,50.570713
2020-875816,2020-04-23,000001,Vente,80000,,,LE HAUT DU MONT D HINGES,B022,62232,62454,Hinges,62,,,62454000AS0124,,,,,,,,,,,,,0,,,,,J,jardins,,,1383,2.621488,50.57061
2020-875816,2020-04-23,000001,Vente,80000,,,LE HAUT DU MONT D HINGES,B022,62232,62454,Hinges,62,,,62454000AS0124,,,,,,,,,,,,,0,,,,,S,sols,,,205,2.621488,50.57061
2020-875946,2020-05-15,000001,Vente,129500,66,,RUE DU 8 MAI,0186,62232,62454,Hinges,62,,,62454000AM0244,,,,,,,,,,,,,0,1,Maison,68,3,S,sols,,,185,2.621899,50.56558
2020-875999,2020-03-31,000001,Vente,140000,8008,,RUE DE MERVILLE,0240,62232,62454,Hinges,62,,,62454000AS0119,,,,,,,,,,,,,0,4,Local industriel. commercial ou assimilé,,0,S,sols,,,661,2.621319,50.570922
2020-875999,2020-03-31,000001,Vente,140000,8008,,RUE DE MERVILLE,0240,62232,62454,Hinges,62,,,62454000AS0119,,,,,,,,,,,,,0,1,Maison,80,5,S,sols,,,661,2.621319,50.570922
2020-875999,2020-03-31,000001,Vente,140000,692,,RUE DU 8 MAI,0186,62232,62454,Hinges,62,,,62454000AS0120,,,,,,,,,,,,,0,4,Local industriel. commercial ou assimilé,5,0,S,sols,,,6,2.621213,50.570996
2020-875999,2020-03-31,000001,Vente,140000,,,LE HAUT DU MONT D HINGES,B022,62232,62454,Hinges,62,,,62454000AS0121,,,,,,,,,,,,,0,,,,,J,jardins,,,912,2.621679,50.570839
2020-875999,2020-03-31,000001,Vente,140000,,,LE HAUT DU MONT D HINGES,B022,62232,62454,Hinges,62,,,62454000AS0121,,,,,,,,,,,,,0,,,,,S,sols,,,294,2.621679,50.570839
2020-875999,2020-03-31,000001,Vente,140000,,,LE HAUT DU MONT D HINGES,B022,62232,62454,Hinges,62,,,62454000AS0122,,,,,,,,,,,,,0,,,,,J,jardins,,,236,2.621857,50.570827
2020-876083,2020-05-27,000001,Vente,115500,771,,RUE DE BETHUNE,0040,62232,62454,Hinges,62,,,62454000AO0008,,,,,,,,,,,,,0,1,Maison,73,3,S,sols,,,511,2.619202,50.55789
2020-876264,2020-05-26,000001,Vente,266000,243,,RUE FROIDE,0120,62232,62454,Hinges,62,,,62454000AS0197,,,,,,,,,,,,,0,1,Maison,160,6,S,sols,,,1780,2.624562,50.569964
2020-876701,2020-06-15,000001,Vente,235000,262,,RUE DE PARADIS,0300,62232,62454,Hinges,62,,,62454000AB0113,,,,,,,,,,,,,0,1,Maison,119,5,S,sols,,,660,2.63659,50.591157
2020-876758,2020-06-22,000001,Vente,229900,97,,RUE DES MEUNIERS,0265,62232,62454,Hinges,62,,,62454000AM0177,,,,,,,,,,,,,0,1,Maison,134,6,S,sols,,,834,2.626555,50.565821
2020-876842,2020-07-17,000001,Vente,10035,,,SOUS LE BOULAN,B044,62232,62454,Hinges,62,,,62454000AL0025,,,,,,,,,,,,,0,,,,,P,prés,,,22572,2.634483,50.568837
2020-876867,2020-07-06,000001,Vente,73000,,,RUE DES HIRONDELLES,0183,62232,62454,Hinges,62,,,62454000AR0194,,,,,,,,,,,,,0,,,,,AB,terrains a bâtir,,,750,2.620135,50.563049
2020-876867,2020-07-06,000001,Vente,73000,,,RUE DES HIRONDELLES,0183,62232,62454,Hinges,62,,,62454000AR0195,,,,,,,,,,,,,0,,,,,S,sols,,,23,2.619938,50.563091
2020-877045,2020-07-31,000001,Vente,92475,,,LE SENTIER DE LOCON,B041,62232,62454,Hinges,62,,,62454000AH0049,,,,,,,,,,,,,0,,,,,T,terres,,,6165,,
2020-877090,2020-08-11,000001,Vente,30000,,,A GAUCHE DU CHEMIN VERT,B019,62232,62454,Hinges,62,,,62454000AE0039,,,,,,,,,,,,,0,,,,,T,terres,,,10196,2.632556,50.578987
2020-877096,2020-08-07,000001,Vente,80000,,,LA COBARDERIE,B011,62232,62454,Hinges,62,,,62454000AD0150,,,,,,,,,,,,,0,,,,,AB,terrains a bâtir,,,1500,2.624958,50.582641
2020-877279,2020-08-14,000001,Vente,67750,1084,,RUE DE MERVILLE,0240,62232,62454,Hinges,62,,,62454000AC0027,,,,,,,,,,,,,0,1,Maison,60,4,S,sols,,,717,2.630171,50.586641
2020-877451,2020-09-04,000001,Vente,245000,476,,RUE FROIDE,0120,62232,62454,Hinges,62,,,62454000AM0093,,,,,,,,,,,,,0,1,Maison,120,4,S,sols,,,750,2.626832,50.568096
2020-877470,2020-09-07,000001,Vente,81000,22,,RUE DE LA POMPE,0320,62232,62454,Hinges,62,,,62454000AS0012,,,,,,,,,,,,,0,1,Maison,91,4,S,sols,,,119,2.619754,50.56791
2020-877501,2020-09-14,000001,Vente,72000,,,PATURES CHEMIN DE MERVILLE,B033,62232,62454,Hinges,62,,,62454000AB0111,,,,,,,,,,,,,0,,,,,T,terres,,,142,2.631365,50.58885
2020-877501,2020-09-14,000001,Vente,72000,,,PATURES CHEMIN DE MERVILLE,B033,62232,62454,Hinges,62,,,62454000AB0111,,,,,,,,,,,,,0,,,,,AB,terrains a bâtir,,,1000,2.631365,50.58885
2020-877566,2020-09-01,000001,Vente,34517,,,RUE DU PLOUY,0360,62232,62454,Hinges,62,,,62454000AN0145,,,,,,,,,,,,,0,,,,,AB,terrains a bâtir,,,360,2.630235,50.561208
2020-878120,2020-09-22,000001,Vente,212500,453,,RUE DE PARADIS,0300,62232,62454,Hinges,62,,,62454000AB0050,,,,,,,,,,,,,0,1,Maison,106,5,S,sols,,,739,2.63951,50.592023
2020-878120,2020-09-22,000001,Vente,212500,453,,RUE DE PARADIS,0300,62232,62454,Hinges,62,,,62454000AB0050,,,,,,,,,,,,,0,1,Maison,106,5,J,jardins,,,1380,2.63951,50.592023
2020-878129,2020-10-05,000001,Vente,1264,,,LE MOULIN D HINGETTE,B029,62232,62454,Hinges,62,,,62454000ZC0029,,,,,,,,,,,,,0,,,,,T,terres,,,2528,2.636738,50.559245
2020-878483,2020-09-29,000001,Vente,237000,120,,RES LES ALOUETTES,A030,62232,62454,Hinges,62,,,62454000AP0044,,,,,,,,,,,,,0,1,Maison,131,6,S,sols,,,747,2.617674,50.558521
2020-878853,2020-10-28,000001,Vente,332000,,,HAMEAU DU VERTANNOY,B021,62232,62454,Hinges,62,,,62454000AR0082,,,,,,,,,,,,,0,,,,,S,sols,,,160,2.614831,50.564973
2020-878853,2020-10-28,000001,Vente,332000,489,,RUE NEUVE,0280,62232,62454,Hinges,62,,,62454000AR0133,,,,,,,,,,,,,0,1,Maison,210,5,S,sols,,,395,2.614676,50.564989
2020-879202,2020-08-25,000001,Vente,85000,,,LE MONT D HINGES,B027,62232,62454,Hinges,62,,,62454000AS0085,,,,,,,,,,,,,0,,,,,J,jardins,,,800,2.622924,50.573858
2020-879202,2020-08-25,000001,Vente,85000,1010,,RUE DU 8 MAI,0186,62232,62454,Hinges,62,,,62454000AS0086,,,,,,,,,,,,,0,1,Maison,62,4,S,sols,,,743,2.622967,50.573704
2020-879202,2020-08-25,000001,Vente,85000,1010,,RUE DU 8 MAI,0186,62232,62454,Hinges,62,,,62454000AS0086,,,,,,,,,,,,,0,3,Dépendance,,0,S,sols,,,743,2.622967,50.573704
2020-879202,2020-08-25,000001,Vente,85000,,,LE MONT D HINGES,B027,62232,62454,Hinges,62,,,62454000AS0087,,,,,,,,,,,,,0,,,,,J,jardins,,,123,2.622676,50.57372
2020-879488,2020-11-23,000001,Vente,515000,788,,RUE D AVELETTE,0016,62232,62454,Hinges,62,,,62454000AK0056,,,,,,,,,,,,,0,1,Maison,182,6,S,sols,,,731,2.638809,50.560453
2020-879488,2020-11-23,000001,Vente,515000,788,,RUE D AVELETTE,0016,62232,62454,Hinges,62,,,62454000AK0056,,,,,,,,,,,,,0,1,Maison,182,6,AG,terrains d'agrément,,,3674,2.638809,50.560453
2020-879581,2020-11-30,000001,Vente,345000,,,PATURES CHEMIN DE MERVILLE,B033,62232,62454,Hinges,62,,,62454000AC0017,,,,,,,,,,,,,0,,,,,P,prés,,,1839,2.632732,50.587903
2020-879581,2020-11-30,000001,Vente,345000,1214,,RUE DE MERVILLE,0240,62232,62454,Hinges,62,,,62454000AC0080,,,,,,,,,,,,,0,,,,,P,prés,,,4648,2.632064,50.587645
2020-879581,2020-11-30,000001,Vente,345000,1214,,RUE DE MERVILLE,0240,62232,62454,Hinges,62,,,62454000AC0088,,,,,,,,,,,,,0,1,Maison,175,7,S,sols,,,1000,2.6306,50.587852
2020-879581,2020-11-30,000001,Vente,345000,1214,,RUE DE MERVILLE,0240,62232,62454,Hinges,62,,,62454000AC0088,,,,,,,,,,,,,0,3,Dépendance,,0,J,jardins,,,723,2.6306,50.587852
2020-879581,2020-11-30,000001,Vente,345000,1214,,RUE DE MERVILLE,0240,62232,62454,Hinges,62,,,62454000AC0088,,,,,,,,,,,,,0,3,Dépendance,,0,S,sols,,,1000,2.6306,50.587852
2020-879581,2020-11-30,000001,Vente,345000,1214,,RUE DE MERVILLE,0240,62232,62454,Hinges,62,,,62454000AC0088,,,,,,,,,,,,,0,1,Maison,175,7,J,jardins,,,723,2.6306,50.587852
2020-879581,2020-11-30,000001,Vente,345000,1214,,RUE DE MERVILLE,0240,62232,62454,Hinges,62,,,62454000AC0088,,,,,,,,,,,,,0,3,Dépendance,,0,J,jardins,,,723,2.6306,50.587852
2020-879581,2020-11-30,000001,Vente,345000,1214,,RUE DE MERVILLE,0240,62232,62454,Hinges,62,,,62454000AC0088,,,,,,,,,,,,,0,3,Dépendance,,0,S,sols,,,1000,2.6306,50.587852
2020-879682,2020-11-05,000001,Vente,100000,1225,,RUE DU HALAGE,0160,62232,62454,Hinges,62,,,62454000AH0044,,,,,,,,,,,,,0,3,Dépendance,,0,S,sols,,,1037,2.637877,50.570834
2020-879682,2020-11-05,000001,Vente,100000,1225,,RUE DU HALAGE,0160,62232,62454,Hinges,62,,,62454000AH0044,,,,,,,,,,,,,0,1,Maison,48,3,S,sols,,,1037,2.637877,50.570834
2020-879682,2020-11-05,000001,Vente,100000,,,LE PETIT HINGETTE,B039,62232,62454,Hinges,62,,,62454000AH0065,,,,,,,,,,,,,0,,,,,T,terres,,,122,2.637619,50.570729
2020-879841,2020-10-15,000002,Vente,140000,700,,RUE D AVELETTE,0016,62232,62454,Hinges,62,,,62454000AK0090,,,,,,,,,,,,,0,1,Maison,78,5,S,sols,,,368,2.64001,50.560787
2020-879841,2020-10-15,000002,Vente,140000,700,,RUE D AVELETTE,0016,62232,62454,Hinges,62,,,62454000AK0090,,,,,,,,,,,,,0,1,Maison,78,5,S,sols,,,368,2.64001,50.560787
2020-879841,2020-10-15,000002,Vente,140000,700,,RUE D AVELETTE,0016,62232,62454,Hinges,62,,,62454000AK0090,,,,,,,,,,,,,0,1,Maison,91,5,S,sols,,,368,2.64001,50.560787
2020-880539,2020-12-23,000001,Vente,271000,175,,RUE DES MESANGES,0263,62232,62454,Hinges,62,,,62454000AR0158,,,,,,,,,,,,,0,1,Maison,111,4,S,sols,,,631,2.619031,50.563403
2020-880635,2020-12-17,000001,Vente,12468.5,,,SOUS LE BOULAN,B044,62232,62454,Hinges,62,,,62454000AL0025,,,,,,,,,,,,,0,,,,,P,prés,,,22572,2.634483,50.568837
2020-880743,2020-12-15,000001,Vente,252900,698,,RUE DE BETHUNE,0040,62232,62454,Hinges,62,,,62454000AP0014,,,,,,,,,,,,,0,1,Maison,139,6,J,jardins,,,1245,2.618489,50.558859
2020-880743,2020-12-15,000001,Vente,252900,698,,RUE DE BETHUNE,0040,62232,62454,Hinges,62,,,62454000AP0014,,,,,,,,,,,,,0,1,Maison,139,6,S,sols,,,598,2.618489,50.558859
