id_mutation,date_mutation,numero_disposition,nature_mutation,valeur_fonciere,adresse_numero,adresse_suffixe,adresse_nom_voie,adresse_code_voie,code_postal,code_commune,nom_commune,code_departement,ancien_code_commune,ancien_nom_commune,id_parcelle,ancien_id_parcelle,numero_volume,lot1_numero,lot1_surface_carrez,lot2_numero,lot2_surface_carrez,lot3_numero,lot3_surface_carrez,lot4_numero,lot4_surface_carrez,lot5_numero,lot5_surface_carrez,nombre_lots,code_type_local,type_local,surface_reelle_bati,nombre_pieces_principales,code_nature_culture,nature_culture,code_nature_culture_speciale,nature_culture_speciale,surface_terrain,longitude,latitude
2020-878011,2020-10-08,000001,Vente,60800,3,,SEN DE LA GARE,0385,62290,62617,Nœux-les-Mines,62,,,62617000AH0118,,,,,,,,,,,,,0,1,Maison,54,2,S,sols,,,195,2.666251,50.479009
2020-878022,2020-09-10,000001,Vente,99123,8,,RUE MOUSSERON,0710,62290,62617,Nœux-les-Mines,62,,,62617000AK0023,,,,,,,,,,,,,0,1,Maison,90,5,S,sols,,,730,2.659247,50.473542
2020-878085,2020-09-21,000001,Vente,87400,5001,F,RES DU STADE,A335,62290,62617,Nœux-les-Mines,62,,,62617000AL0049,,,29,81.64,,,,,,,,,1,2,Appartement,81,4,,,,,,2.668677,50.471955
2020-878085,2020-09-21,000001,Vente,87400,5001,F,RES DU STADE,A335,62290,62617,Nœux-les-Mines,62,,,62617000AL0049,,,8,,,,,,,,,,1,3,Dépendance,,0,,,,,,2.668677,50.471955
2020-878091,2020-10-13,000001,Vente,133600,12,B,RUE BEHARELLE,0080,62290,62617,Nœux-les-Mines,62,,,62617000AK0171,,,,,,,,,,,,,0,1,Maison,90,4,S,sols,,,502,2.665172,50.473335
2020-878096,2020-09-18,000001,Vente,142500,69,,RUE JEAN JAURES,0480,62290,62617,Nœux-les-Mines,62,,,62617000AI0064,,,,,,,,,,,,,0,1,Maison,79,5,S,sols,,,474,2.656862,50.476057
2020-878102,2020-09-18,000002,Vente,84000,,,RUE DE LENS,0560,62290,62617,Nœux-les-Mines,62,,,62617000AH1579,,,,,,,,,,,,,0,,,,,S,sols,,,1,2.669655,50.481601
2020-878102,2020-09-18,000002,Vente,84000,2,,RUE DE CALAIS,0150,62290,62617,Nœux-les-Mines,62,,,62617000AH1580,,,,,,,,,,,,,0,1,Maison,79,4,S,sols,,,351,2.669823,50.481627
2020-878102,2020-09-18,000002,Vente,84000,2,,RUE DE CALAIS,0150,62290,62617,Nœux-les-Mines,62,,,62617000AH1580,,,,,,,,,,,,,0,3,Dépendance,,0,S,sols,,,351,2.669823,50.481627
2020-878171,2020-10-14,000001,Vente,35000,1,A,RUE DES DEPORTES TRAIN DE LOOS,0301,62290,62617,Nœux-les-Mines,62,,,62617000AK0535,,,,,,,,,,,,,0,3,Dépendance,,0,S,sols,,,589,2.66414,50.470416
2020-878171,2020-10-14,000001,Vente,35000,1,A,RUE DES DEPORTES TRAIN DE LOOS,0301,62290,62617,Nœux-les-Mines,62,,,62617000AK0535,,,,,,,,,,,,,0,1,Maison,72,3,S,sols,,,589,2.66414,50.470416
2020-878201,2020-09-16,000001,Vente,97000,13,,RUE FRANCISCO FERRER,0370,62290,62617,Nœux-les-Mines,62,,,62617000AB0412,,,,,,,,,,,,,0,1,Maison,84,3,S,sols,,,470,2.660806,50.479617
2020-878220,2020-08-05,000002,Echange,2500,,,RUE SAINT NICOLAS,0900,62290,62617,Nœux-les-Mines,62,,,62617000AB0591,,,,,,,,,,,,,0,,,,,S,sols,,,262,2.65857,50.480399
2020-878220,2020-08-05,000002,Echange,2500,,,SEN SAINT NICOLAS,0910,62290,62617,Nœux-les-Mines,62,,,62617000AB0593,,,,,,,,,,,,,0,,,,,S,sols,,,68,2.659203,50.480853
2020-878220,2020-08-05,000002,Echange,2500,1,,SEN SAINT NICOLAS,0910,62290,62617,Nœux-les-Mines,62,,,62617000AB0909,,,,,,,,,,,,,0,,,,,S,sols,,,7,2.659324,50.48095
2020-878220,2020-08-05,000003,Echange,2500,,,LE BLAMONT,B002,62290,62617,Nœux-les-Mines,62,,,62617000AT0067,,,,,,,,,,,,,0,,,,,T,terres,,,1901,2.644564,50.469318
2020-878224,2020-09-25,000001,Vente,120000,6,,RUE DE L ALMA,0020,62290,62617,Nœux-les-Mines,62,,,62617000AR0078,,,,,,,,,,,,,0,2,Appartement,11,1,S,sols,,,1000,,
2020-878224,2020-09-25,000001,Vente,120000,6,,RUE DE L ALMA,0020,62290,62617,Nœux-les-Mines,62,,,62617000AR0078,,,,,,,,,,,,,0,2,Appartement,11,1,S,sols,,,1000,,
2020-878224,2020-09-25,000001,Vente,120000,6,,RUE DE L ALMA,0020,62290,62617,Nœux-les-Mines,62,,,62617000AR0078,,,,,,,,,,,,,0,2,Appartement,11,1,S,sols,,,1000,,
2020-878224,2020-09-25,000001,Vente,120000,6,,RUE DE L ALMA,0020,62290,62617,Nœux-les-Mines,62,,,62617000AR0078,,,,,,,,,,,,,0,2,Appartement,11,1,S,sols,,,1000,,
2020-878224,2020-09-25,000001,Vente,120000,6,,RUE DE L ALMA,0020,62290,62617,Nœux-les-Mines,62,,,62617000AR0078,,,,,,,,,,,,,0,2,Appartement,11,1,S,sols,,,1000,,
2020-878224,2020-09-25,000001,Vente,120000,6,,RUE DE L ALMA,0020,62290,62617,Nœux-les-Mines,62,,,62617000AR0078,,,,,,,,,,,,,0,2,Appartement,11,1,S,sols,,,1000,,
2020-878224,2020-09-25,000001,Vente,120000,6,,RUE DE L ALMA,0020,62290,62617,Nœux-les-Mines,62,,,62617000AR0078,,,,,,,,,,,,,0,2,Appartement,11,1,S,sols,,,1000,,
2020-878224,2020-09-25,000001,Vente,120000,6,,RUE DE L ALMA,0020,62290,62617,Nœux-les-Mines,62,,,62617000AR0078,,,,,,,,,,,,,0,2,Appartement,11,1,S,sols,,,1000,,
2020-878224,2020-09-25,000001,Vente,120000,6,,RUE DE L ALMA,0020,62290,62617,Nœux-les-Mines,62,,,62617000AR0078,,,,,,,,,,,,,0,2,Appartement,11,1,S,sols,,,1000,,
2020-878224,2020-09-25,000001,Vente,120000,6,,RUE DE L ALMA,0020,62290,62617,Nœux-les-Mines,62,,,62617000AR0078,,,,,,,,,,,,,0,2,Appartement,11,1,S,sols,,,1000,,
2020-878224,2020-09-25,000001,Vente,120000,6,,RUE DE L ALMA,0020,62290,62617,Nœux-les-Mines,62,,,62617000AR0078,,,,,,,,,,,,,0,2,Appartement,11,1,S,sols,,,1000,,
2020-878224,2020-09-25,000001,Vente,120000,6,,RUE DE L ALMA,0020,62290,62617,Nœux-les-Mines,62,,,62617000AR0078,,,,,,,,,,,,,0,2,Appartement,11,1,S,sols,,,1000,,
2020-878224,2020-09-25,000001,Vente,120000,6,,RUE DE L ALMA,0020,62290,62617,Nœux-les-Mines,62,,,62617000AR0078,,,,,,,,,,,,,0,2,Appartement,11,1,S,sols,,,1000,,
2020-878224,2020-09-25,000001,Vente,120000,6,,RUE DE L ALMA,0020,62290,62617,Nœux-les-Mines,62,,,62617000AR0078,,,,,,,,,,,,,0,2,Appartement,11,1,S,sols,,,1000,,
2020-878224,2020-09-25,000001,Vente,120000,6,,RUE DE L ALMA,0020,62290,62617,Nœux-les-Mines,62,,,62617000AR0078,,,,,,,,,,,,,0,2,Appartement,11,1,S,sols,,,1000,,
2020-878287,2020-10-09,000001,Vente,156800,3,,RUE COLBERT,0215,62290,62617,Nœux-les-Mines,62,,,62617000AN0345,,,,,,,,,,,,,0,1,Maison,84,5,S,sols,,,472,2.676519,50.474656
2020-878346,2020-10-12,000001,Vente,115000,68,,RUE FLEMING,0355,62290,62617,Nœux-les-Mines,62,,,62617000AI0087,,,,,,,,,,,,,0,3,Dépendance,,0,S,sols,,,264,2.656295,50.476496
2020-878346,2020-10-12,000001,Vente,115000,68,,RUE FLEMING,0355,62290,62617,Nœux-les-Mines,62,,,62617000AI0087,,,,,,,,,,,,,0,1,Maison,82,4,S,sols,,,264,2.656295,50.476496
2020-878350,2020-09-25,000001,Vente,95000,11,T,RUE DE BRUAY,0110,62290,62617,Nœux-les-Mines,62,,,62617000AB0482,,,,,,,,,,,,,0,1,Maison,66,4,S,sols,,,397,2.657089,50.478645
2020-878350,2020-09-25,000001,Vente,95000,11,T,RUE DE BRUAY,0110,62290,62617,Nœux-les-Mines,62,,,62617000AB0482,,,,,,,,,,,,,0,3,Dépendance,,0,S,sols,,,397,2.657089,50.478645
2020-878476,2020-10-03,000001,Vente,60000,277,,RUE NATIONALE,0750,62290,62617,Nœux-les-Mines,62,,,62617000AL0249,,,,,,,,,,,,,0,1,Maison,112,5,S,sols,,,251,2.666446,50.47546
2020-878512,2020-10-12,000001,Vente,95000,2,,RUE DES TULIPES,1000,62290,62617,Nœux-les-Mines,62,,,62617000AM0217,,,,,,,,,,,,,0,1,Maison,99,5,S,sols,,,131,2.675946,50.472737
2020-878512,2020-10-12,000001,Vente,95000,2,,RUE DES TULIPES,1000,62290,62617,Nœux-les-Mines,62,,,62617000AM0217,,,,,,,,,,,,,0,3,Dépendance,,0,S,sols,,,131,2.675946,50.472737
2020-878512,2020-10-12,000001,Vente,95000,2,,RUE DES TULIPES,1000,62290,62617,Nœux-les-Mines,62,,,62617000AM0217,,,,,,,,,,,,,0,3,Dépendance,,0,J,jardins,,,430,2.675946,50.472737
2020-878512,2020-10-12,000001,Vente,95000,2,,RUE DES TULIPES,1000,62290,62617,Nœux-les-Mines,62,,,62617000AM0217,,,,,,,,,,,,,0,1,Maison,99,5,J,jardins,,,430,2.675946,50.472737
2020-878613,2020-10-22,000001,Vente,136640,7,B,RUE DE BARLIN,0060,62290,62617,Nœux-les-Mines,62,,,62617000AT0367,,,,,,,,,,,,,0,1,Maison,126,5,S,sols,,,192,2.650684,50.473479
2020-878613,2020-10-22,000001,Vente,136640,7,B,RUE DE BARLIN,0060,62290,62617,Nœux-les-Mines,62,,,62617000AT0373,,,,,,,,,,,,,0,3,Dépendance,,0,S,sols,,,20,2.651072,50.473515
2020-878613,2020-10-22,000001,Vente,136640,,,RUE DE BARLIN,0060,62290,62617,Nœux-les-Mines,62,,,62617000AT0381,,,,,,,,,,,,,0,,,,,S,sols,,,372,2.650887,50.473512
2020-878629,2020-10-23,000001,Vente,45000,258,,RUE NATIONALE,0750,62290,62617,Nœux-les-Mines,62,,,62617000AK0446,,,,,,,,,,,,,0,2,Appartement,57,2,S,sols,,,67,2.66558,50.475579
2020-878629,2020-10-23,000001,Vente,45000,258,,RUE NATIONALE,0750,62290,62617,Nœux-les-Mines,62,,,62617000AK0446,,,,,,,,,,,,,0,2,Appartement,56,2,S,sols,,,67,2.66558,50.475579
2020-878672,2020-10-31,000001,Vente,77500,36,,RUE DU DAHOMEY,0280,62290,62617,Nœux-les-Mines,62,,,62617000AP0972,,,,,,,,,,,,,0,1,Maison,95,5,S,sols,,,222,2.679993,50.46631
2020-878708,2020-10-12,000001,Vente,4000,,,VALLEE DU CELLIER,B015,62290,62617,Nœux-les-Mines,62,,,62617000AO0211,,,,,,,,,,,,,0,,,,,T,terres,,,748,2.683609,50.466567
2020-878716,2020-10-28,000001,Vente,75600,111,,RUE MOUSSY,0720,62290,62617,Nœux-les-Mines,62,,,62617000AM0310,,,,,,,,,,,,,0,3,Dépendance,,0,S,sols,,,286,2.676827,50.46976
2020-878716,2020-10-28,000001,Vente,75600,111,,RUE MOUSSY,0720,62290,62617,Nœux-les-Mines,62,,,62617000AM0310,,,,,,,,,,,,,0,1,Maison,49,2,S,sols,,,286,2.676827,50.46976
2020-878774,2020-06-26,000001,Vente,136500,49,,RUE CHARCOT,0202,62290,62617,Nœux-les-Mines,62,,,62617000AC0305,,,,,,,,,,,,,0,1,Maison,83,4,S,sols,,,333,2.661111,50.488594
2020-878800,2020-10-08,000001,Vente,105000,38,,RUE SAINT NICOLAS,0900,62290,62617,Nœux-les-Mines,62,,,62617000AB0026,,,,,,,,,,,,,0,1,Maison,89,4,S,sols,,,353,2.657649,50.481346
2020-878814,2020-10-02,000001,Vente,38650,96,,RUE ROGER SALENGRO,0850,62290,62617,Nœux-les-Mines,62,,,62617000AI0576,,,,,,,,,,,,,0,1,Maison,51,3,S,sols,,,67,2.655738,50.47453
2020-878859,2020-10-19,000001,Vente,136000,48,,RUE BASSE,0070,62290,62617,Nœux-les-Mines,62,,,62617000AB0223,,,,,,,,,,,,,0,1,Maison,113,5,S,sols,,,317,2.664735,50.481425
2020-879089,2020-11-13,000001,Vente,327000,1,,BD DE SEBASTOPOL,0950,62290,62617,Nœux-les-Mines,62,,,62617000AR0495,,,,,,,,,,,,,0,1,Maison,244,8,J,jardins,,,2224,2.671237,50.464311
2020-879089,2020-11-13,000001,Vente,327000,1,,BD DE SEBASTOPOL,0950,62290,62617,Nœux-les-Mines,62,,,62617000AR0495,,,,,,,,,,,,,0,1,Maison,244,8,S,sols,,,641,2.671237,50.464311
2020-879104,2020-10-22,000001,Vente,13000,,,RUE D HINGETTES,0450,62290,62617,Nœux-les-Mines,62,,,62617000AB0219,,,,,,,,,,,,,0,,,,,S,sols,,,37,2.664099,50.481571
2020-879107,2020-11-12,000001,Vente,58000,6,,RUE DU GENERAL LECLERC,0390,62290,62617,Nœux-les-Mines,62,,,62617000AH0207,,,,,,,,,,,,,0,1,Maison,90,3,S,sols,,,65,2.668237,50.482087
2020-879187,2020-10-26,000001,Vente,167250,13,,RUE PIERRE BROSSOLETTE,0843,62290,62617,Nœux-les-Mines,62,,,62617000AE0161,,,,,,,,,,,,,0,1,Maison,83,4,S,sols,,,611,2.672458,50.483226
2020-879282,2020-11-09,000001,Vente,123500,80,B,RUE DE L EGALITE,0330,62290,62617,Nœux-les-Mines,62,,,62617000AE0546,,,,,,,,,,,,,0,1,Maison,97,4,S,sols,,,361,2.667096,50.485204
2020-879282,2020-11-09,000001,Vente,123500,80,B,RUE DE L EGALITE,0330,62290,62617,Nœux-les-Mines,62,,,62617000AE0546,,,,,,,,,,,,,0,1,Maison,97,4,J,jardins,,,999,2.667096,50.485204
2020-879550,2020-11-27,000001,Vente,100000,348,,RUE NATIONALE,0750,62290,62617,Nœux-les-Mines,62,,,62617000AM0499,,,,,,,,,,,,,0,3,Dépendance,,0,S,sols,,,271,2.670793,50.470089
2020-879550,2020-11-27,000001,Vente,100000,348,,RUE NATIONALE,0750,62290,62617,Nœux-les-Mines,62,,,62617000AM0499,,,,,,,,,,,,,0,3,Dépendance,,0,S,sols,,,271,2.670793,50.470089
2020-879550,2020-11-27,000001,Vente,100000,348,,RUE NATIONALE,0750,62290,62617,Nœux-les-Mines,62,,,62617000AM0499,,,,,,,,,,,,,0,3,Dépendance,,0,S,sols,,,271,2.670793,50.470089
2020-879550,2020-11-27,000001,Vente,100000,348,,RUE NATIONALE,0750,62290,62617,Nœux-les-Mines,62,,,62617000AM0499,,,,,,,,,,,,,0,3,Dépendance,,0,S,sols,,,271,2.670793,50.470089
2020-879550,2020-11-27,000001,Vente,100000,348,,RUE NATIONALE,0750,62290,62617,Nœux-les-Mines,62,,,62617000AM0499,,,,,,,,,,,,,0,3,Dépendance,,0,S,sols,,,271,2.670793,50.470089
2020-879550,2020-11-27,000001,Vente,100000,348,,RUE NATIONALE,0750,62290,62617,Nœux-les-Mines,62,,,62617000AM0499,,,,,,,,,,,,,0,3,Dépendance,,0,S,sols,,,271,2.670793,50.470089
2020-879550,2020-11-27,000001,Vente,100000,348,,RUE NATIONALE,0750,62290,62617,Nœux-les-Mines,62,,,62617000AM0499,,,,,,,,,,,,,0,3,Dépendance,,0,S,sols,,,271,2.670793,50.470089
2020-879550,2020-11-27,000001,Vente,100000,348,,RUE NATIONALE,0750,62290,62617,Nœux-les-Mines,62,,,62617000AM0499,,,,,,,,,,,,,0,3,Dépendance,,0,S,sols,,,271,2.670793,50.470089
2020-879550,2020-11-27,000001,Vente,100000,348,,RUE NATIONALE,0750,62290,62617,Nœux-les-Mines,62,,,62617000AM0499,,,,,,,,,,,,,0,3,Dépendance,,0,S,sols,,,271,2.670793,50.470089
2020-879550,2020-11-27,000001,Vente,100000,348,,RUE NATIONALE,0750,62290,62617,Nœux-les-Mines,62,,,62617000AM0499,,,,,,,,,,,,,0,3,Dépendance,,0,S,sols,,,271,2.670793,50.470089
2020-879550,2020-11-27,000001,Vente,100000,348,,RUE NATIONALE,0750,62290,62617,Nœux-les-Mines,62,,,62617000AM0499,,,,,,,,,,,,,0,3,Dépendance,,0,S,sols,,,271,2.670793,50.470089
2020-879550,2020-11-27,000001,Vente,100000,348,,RUE NATIONALE,0750,62290,62617,Nœux-les-Mines,62,,,62617000AM0499,,,,,,,,,,,,,0,3,Dépendance,,0,S,sols,,,271,2.670793,50.470089
2020-879550,2020-11-27,000001,Vente,100000,348,,RUE NATIONALE,0750,62290,62617,Nœux-les-Mines,62,,,62617000AM0499,,,,,,,,,,,,,0,1,Maison,52,2,S,sols,,,271,2.670793,50.470089
2020-879550,2020-11-27,000001,Vente,100000,348,,RUE NATIONALE,0750,62290,62617,Nœux-les-Mines,62,,,62617000AM0499,,,,,,,,,,,,,0,4,Local industriel. commercial ou assimilé,90,0,S,sols,,,271,2.670793,50.470089
2020-879550,2020-11-27,000001,Vente,100000,348,,RUE NATIONALE,0750,62290,62617,Nœux-les-Mines,62,,,62617000AM0499,,,,,,,,,,,,,0,1,Maison,113,5,S,sols,,,271,2.670793,50.470089
2020-879550,2020-11-27,000001,Vente,100000,348,,RUE NATIONALE,0750,62290,62617,Nœux-les-Mines,62,,,62617000AM0499,,,,,,,,,,,,,0,3,Dépendance,,0,S,sols,,,271,2.670793,50.470089
2020-879550,2020-11-27,000001,Vente,100000,348,,RUE NATIONALE,0750,62290,62617,Nœux-les-Mines,62,,,62617000AM0499,,,,,,,,,,,,,0,1,Maison,107,3,S,sols,,,271,2.670793,50.470089
2020-879550,2020-11-27,000001,Vente,100000,,,RUE NATIONALE,0750,62290,62617,Nœux-les-Mines,62,,,62617000AM0500,,,,,,,,,,,,,0,,,,,S,sols,,,41,2.670774,50.470186
2020-879554,2020-11-27,000001,Vente,80000,15,,RUE VICTOR HUGO,1035,62290,62617,Nœux-les-Mines,62,,,62617000AI0220,,,,,,,,,,,,,0,1,Maison,68,4,S,sols,,,233,2.661433,50.476523
2020-879644,2020-11-30,000001,Vente,56000,2,,PL DU CHATEAU D EAU,0203,62290,62617,Nœux-les-Mines,62,,,62617000AP0871,,,,,,,,,,,,,0,1,Maison,70,3,S,sols,,,51,2.674305,50.464695
2020-879676,2020-11-04,000001,Vente,20000,17,,RUE DU GENERAL LECLERC,0390,62290,62617,Nœux-les-Mines,62,,,62617000AE0265,,,,,,,,,,,,,0,1,Maison,94,4,S,sols,,,140,2.668671,50.482196
2020-879707,2020-11-04,000001,Vente,10000,19,,RUE DU GENERAL LECLERC,0390,62290,62617,Nœux-les-Mines,62,,,62617000AE0264,,,,,,,,,,,,,0,1,Maison,69,2,S,sols,,,99,2.668739,50.482168
2020-879707,2020-11-04,000001,Vente,10000,19,,RUE DU GENERAL LECLERC,0390,62290,62617,Nœux-les-Mines,62,,,62617000AE0264,,,,,,,,,,,,,0,3,Dépendance,,0,S,sols,,,99,2.668739,50.482168
2020-879707,2020-11-04,000001,Vente,10000,19,,RUE DU GENERAL LECLERC,0390,62290,62617,Nœux-les-Mines,62,,,62617000AE0264,,,,,,,,,,,,,0,3,Dépendance,,0,S,sols,,,99,2.668739,50.482168
2020-879715,2020-11-13,000003,Vente,68913,22,,RUE BUGEAUD,0120,62290,62617,Nœux-les-Mines,62,,,62617000AR0967,,,,,,,,,,,,,0,1,Maison,70,4,,,,,,2.667899,50.467877
2020-879715,2020-11-13,000003,Vente,68913,24,,RUE BUGEAUD,0120,62290,62617,Nœux-les-Mines,62,,,62617000AR0969,,,,,,,,,,,,,0,,,,,S,sols,,,151,2.667827,50.467829
2020-879752,2020-12-03,000001,Vente,263000,,,RUE JEAN JAURES,0480,62290,62617,Nœux-les-Mines,62,,,62617000AI0654,,,,,,,,,,,,,0,,,,,AB,terrains a bâtir,,,552,2.654379,50.475669
2020-879780,2020-11-12,000001,Vente,85000,24,,RUE D HINGETTES,0450,62290,62617,Nœux-les-Mines,62,,,62617000AB0156,,,,,,,,,,,,,0,1,Maison,76,5,S,sols,,,690,2.663952,50.481751
2020-879785,2020-12-04,000001,Vente,164150,37,,RUE NATIONALE,0750,62290,62617,Nœux-les-Mines,62,,,62617000AC0129,,,,,,,,,,,,,0,1,Maison,125,6,S,sols,,,629,2.658269,50.486175
2020-879833,2020-12-03,000001,Vente,272250,8,,IMP DU BOUTIMONT,0103,62290,62617,Nœux-les-Mines,62,,,62617000AI0679,,,,,,,,,,,,,0,1,Maison,152,6,S,sols,,,750,2.65492,50.476785
2020-879905,2020-12-07,000001,Vente terrain à bâtir,37628,8007,F,RUE DE BOULOGNE,0100,62290,62617,Nœux-les-Mines,62,,,62617000AH1554,,,,,,,,,,,,,0,4,Local industriel. commercial ou assimilé,,0,S,sols,,,5,2.672658,50.480918
2020-879905,2020-12-07,000001,Vente terrain à bâtir,37628,,,RUE DE CALAIS,0150,62290,62617,Nœux-les-Mines,62,,,62617000AH1559,,,,,,,,,,,,,0,,,,,AB,terrains a bâtir,,,270,2.672766,50.480836
2020-879905,2020-12-07,000001,Vente terrain à bâtir,37628,,,RUE DE CALAIS,0150,62290,62617,Nœux-les-Mines,62,,,62617000AH1563,,,,,,,,,,,,,0,,,,,AB,terrains a bâtir,,,126,2.672867,50.480799
2020-879914,2020-12-07,000001,Vente,211000,6,,RUE HECTOR BERLIOZ,0429,62290,62617,Nœux-les-Mines,62,,,62617000AO0553,,,,,,,,,,,,,0,1,Maison,101,5,S,sols,,,708,2.680677,50.467335
2020-879929,2020-12-03,000001,Vente,142900,8,,RUE VOLTAIRE,1050,62290,62617,Nœux-les-Mines,62,,,62617000AI0425,,,,,,,,,,,,,0,1,Maison,81,4,S,sols,,,478,2.656759,50.473521
2020-879968,2020-11-25,000002,Vente,399812,,,VALLEE DU CELLIER,B015,62290,62617,Nœux-les-Mines,62,,,62617000AO0632,,,,,,,,,,,,,0,,,,,AB,terrains a bâtir,,,6592,2.683466,50.467703
2020-879968,2020-11-25,000002,Vente,399812,,,VALLEE DU CELLIER,B015,62290,62617,Nœux-les-Mines,62,,,62617000AO0633,,,,,,,,,,,,,0,,,,,AB,terrains a bâtir,,,83,2.684502,50.466883
2020-879968,2020-11-25,000002,Vente,399812,,,VALLEE DU CELLIER,B015,62290,62617,Nœux-les-Mines,62,,,62617000AO0634,,,,,,,,,,,,,0,,,,,AB,terrains a bâtir,,,217,2.684222,50.467015
2020-879968,2020-11-25,000002,Vente,399812,,,VALLEE DU CELLIER,B015,62290,62617,Nœux-les-Mines,62,,,62617000AO0635,,,,,,,,,,,,,0,,,,,AB,terrains a bâtir,,,727,2.683875,50.467179
2020-879968,2020-11-25,000002,Vente,399812,,,VALLEE DU CELLIER,B015,62290,62617,Nœux-les-Mines,62,,,62617000AO0636,,,,,,,,,,,,,0,,,,,AB,terrains a bâtir,,,767,2.683541,50.467241
2020-879968,2020-11-25,000002,Vente,399812,,,VALLEE DU CELLIER,B015,62290,62617,Nœux-les-Mines,62,,,62617000AO0637,,,,,,,,,,,,,0,,,,,AB,terrains a bâtir,,,761,2.683281,50.467347
2020-879968,2020-11-25,000002,Vente,399812,,,VALLEE DU CELLIER,B015,62290,62617,Nœux-les-Mines,62,,,62617000AO0638,,,,,,,,,,,,,0,,,,,AB,terrains a bâtir,,,748,2.683087,50.467508
2020-879968,2020-11-25,000002,Vente,399812,,,VALLEE DU CELLIER,B015,62290,62617,Nœux-les-Mines,62,,,62617000AO0639,,,,,,,,,,,,,0,,,,,AB,terrains a bâtir,,,654,2.683314,50.46776
2020-879968,2020-11-25,000002,Vente,399812,,,VALLEE DU CELLIER,B015,62290,62617,Nœux-les-Mines,62,,,62617000AO0640,,,,,,,,,,,,,0,,,,,AB,terrains a bâtir,,,678,2.683556,50.467659
2020-879968,2020-11-25,000002,Vente,399812,,,VALLEE DU CELLIER,B015,62290,62617,Nœux-les-Mines,62,,,62617000AO0641,,,,,,,,,,,,,0,,,,,AB,terrains a bâtir,,,678,2.683846,50.467615
2020-879968,2020-11-25,000002,Vente,399812,,,VALLEE DU CELLIER,B015,62290,62617,Nœux-les-Mines,62,,,62617000AO0642,,,,,,,,,,,,,0,,,,,AB,terrains a bâtir,,,679,2.684085,50.467519
2020-879968,2020-11-25,000002,Vente,399812,,,VALLEE DU CELLIER,B015,62290,62617,Nœux-les-Mines,62,,,62617000AO0643,,,,,,,,,,,,,0,,,,,AB,terrains a bâtir,,,695,2.684326,50.467421
2020-879968,2020-11-25,000002,Vente,399812,,,VALLEE DU CELLIER,B015,62290,62617,Nœux-les-Mines,62,,,62617000AO0644,,,,,,,,,,,,,0,,,,,AB,terrains a bâtir,,,670,2.684757,50.467049
2020-879968,2020-11-25,000002,Vente,399812,,,VALLEE DU CELLIER,B015,62290,62617,Nœux-les-Mines,62,,,62617000AO0645,,,,,,,,,,,,,0,,,,,AB,terrains a bâtir,,,707,2.684953,50.467258
2020-879968,2020-11-25,000002,Vente,399812,,,VALLEE DU CELLIER,B015,62290,62617,Nœux-les-Mines,62,,,62617000AO0646,,,,,,,,,,,,,0,,,,,AB,terrains a bâtir,,,728,2.684878,50.46768
2020-879968,2020-11-25,000002,Vente,399812,,,VALLEE DU CELLIER,B015,62290,62617,Nœux-les-Mines,62,,,62617000AO0647,,,,,,,,,,,,,0,,,,,AB,terrains a bâtir,,,685,2.684599,50.467771
2020-879968,2020-11-25,000002,Vente,399812,,,VALLEE DU CELLIER,B015,62290,62617,Nœux-les-Mines,62,,,62617000AO0648,,,,,,,,,,,,,0,,,,,AB,terrains a bâtir,,,685,2.684366,50.467865
2020-879968,2020-11-25,000002,Vente,399812,,,VALLEE DU CELLIER,B015,62290,62617,Nœux-les-Mines,62,,,62617000AO0649,,,,,,,,,,,,,0,,,,,AB,terrains a bâtir,,,667,2.684137,50.467957
2020-879968,2020-11-25,000002,Vente,399812,,,VALLEE DU CELLIER,B015,62290,62617,Nœux-les-Mines,62,,,62617000AO0650,,,,,,,,,,,,,0,,,,,AB,terrains a bâtir,,,666,2.68391,50.468048
2020-879968,2020-11-25,000002,Vente,399812,,,VALLEE DU CELLIER,B015,62290,62617,Nœux-les-Mines,62,,,62617000AO0651,,,,,,,,,,,,,0,,,,,AB,terrains a bâtir,,,665,2.683644,50.468121
2020-879968,2020-11-25,000002,Vente,399812,,,VALLEE DU CELLIER,B015,62290,62617,Nœux-les-Mines,62,,,62617000AO0652,,,,,,,,,,,,,0,,,,,AB,terrains a bâtir,,,627,2.683462,50.468237
2020-879968,2020-11-25,000002,Vente,399812,,,VALLEE DU CELLIER,B015,62290,62617,Nœux-les-Mines,62,,,62617000AO0653,,,,,,,,,,,,,0,,,,,AB,terrains a bâtir,,,626,2.683236,50.468328
2020-879968,2020-11-25,000002,Vente,399812,,,VALLEE DU CELLIER,B015,62290,62617,Nœux-les-Mines,62,,,62617000AO0654,,,,,,,,,,,,,0,,,,,AB,terrains a bâtir,,,609,2.683012,50.468418
2020-879968,2020-11-25,000002,Vente,399812,,,VALLEE DU CELLIER,B015,62290,62617,Nœux-les-Mines,62,,,62617000AO0655,,,,,,,,,,,,,0,,,,,AB,terrains a bâtir,,,609,2.682791,50.468507
2020-879968,2020-11-25,000002,Vente,399812,,,VALLEE DU CELLIER,B015,62290,62617,Nœux-les-Mines,62,,,62617000AO0656,,,,,,,,,,,,,0,,,,,AB,terrains a bâtir,,,657,2.68256,50.4686
2020-879968,2020-11-25,000002,Vente,399812,,,VALLEE DU CELLIER,B015,62290,62617,Nœux-les-Mines,62,,,62617000AO0657,,,,,,,,,,,,,0,,,,,AB,terrains a bâtir,,,694,2.682318,50.468216
2020-879968,2020-11-25,000002,Vente,399812,,,VALLEE DU CELLIER,B015,62290,62617,Nœux-les-Mines,62,,,62617000AO0658,,,,,,,,,,,,,0,,,,,AB,terrains a bâtir,,,685,2.682508,50.468106
2020-879968,2020-11-25,000002,Vente,399812,,,VALLEE DU CELLIER,B015,62290,62617,Nœux-les-Mines,62,,,62617000AO0659,,,,,,,,,,,,,0,,,,,AB,terrains a bâtir,,,685,2.682803,50.468059
2020-879968,2020-11-25,000002,Vente,399812,,,VALLEE DU CELLIER,B015,62290,62617,Nœux-les-Mines,62,,,62617000AO0660,,,,,,,,,,,,,0,,,,,AB,terrains a bâtir,,,685,2.683047,50.46796
2020-879968,2020-11-25,000002,Vente,399812,,,VALLEE DU CELLIER,B015,62290,62617,Nœux-les-Mines,62,,,62617000AO0661,,,,,,,,,,,,,0,,,,,AB,terrains a bâtir,,,784,2.682818,50.467571
2020-879968,2020-11-25,000002,Vente,399812,,,VALLEE DU CELLIER,B015,62290,62617,Nœux-les-Mines,62,,,62617000AO0662,,,,,,,,,,,,,0,,,,,AB,terrains a bâtir,,,802,2.682571,50.46769
2020-879968,2020-11-25,000002,Vente,399812,,,VALLEE DU CELLIER,B015,62290,62617,Nœux-les-Mines,62,,,62617000AO0663,,,,,,,,,,,,,0,,,,,AB,terrains a bâtir,,,776,2.682316,50.467754
2020-879968,2020-11-25,000002,Vente,399812,,,VALLEE DU CELLIER,B015,62290,62617,Nœux-les-Mines,62,,,62617000AO0664,,,,,,,,,,,,,0,,,,,AB,terrains a bâtir,,,768,2.682063,50.467858
2020-879968,2020-11-25,000002,Vente,399812,,,VALLEE DU CELLIER,B015,62290,62617,Nœux-les-Mines,62,,,62617000AO0665,,,,,,,,,,,,,0,,,,,AB,terrains a bâtir,,,760,2.681815,50.467958
2020-879968,2020-11-25,000002,Vente,399812,,,VALLEE DU CELLIER,B015,62290,62617,Nœux-les-Mines,62,,,62617000AO0670,,,,,,,,,,,,,0,,,,,AB,terrains a bâtir,,,19,2.685141,50.467692
2020-879968,2020-11-25,000002,Vente,399812,,,VALLEE DU CELLIER,B015,62290,62617,Nœux-les-Mines,62,,,62617000AO0671,,,,,,,,,,,,,0,,,,,AB,terrains a bâtir,,,19,2.685068,50.467553
2020-879988,2020-12-10,000001,Vente,71000,98,,RUE NATIONALE,0750,62290,62617,Nœux-les-Mines,62,,,62617000AB0058,,,,,,,,,,,,,0,1,Maison,104,4,S,sols,,,145,2.65955,50.482125
2020-879994,2020-12-11,000001,Vente,110000,334,,RUE NATIONALE,0750,62290,62617,Nœux-les-Mines,62,,,62617000AM0141,,,,,,,,,,,,,0,1,Maison,118,5,S,sols,,,550,2.66969,50.470951