id_mutation,date_mutation,numero_disposition,nature_mutation,valeur_fonciere,adresse_numero,adresse_suffixe,adresse_nom_voie,adresse_code_voie,code_postal,code_commune,nom_commune,code_departement,ancien_code_commune,ancien_nom_commune,id_parcelle,ancien_id_parcelle,numero_volume,lot1_numero,lot1_surface_carrez,lot2_numero,lot2_surface_carrez,lot3_numero,lot3_surface_carrez,lot4_numero,lot4_surface_carrez,lot5_numero,lot5_surface_carrez,nombre_lots,code_type_local,type_local,surface_reelle_bati,nombre_pieces_principales,code_nature_culture,nature_culture,code_nature_culture_speciale,nature_culture_speciale,surface_terrain,longitude,latitude
2020-884750,2020-02-20,000001,Vente,208000,520,,RUE DE L'EGLISE,0035,62850,62775,Sanghen,62,,,627750000A0180,,,,,,,,,,,,,0,1,Maison,104,4,P,prés,,,355,1.911062,50.781972
2020-884750,2020-02-20,000001,Vente,208000,520,,RUE DE L'EGLISE,0035,62850,62775,Sanghen,62,,,627750000A0180,,,,,,,,,,,,,0,1,Maison,104,4,AB,terrains a bâtir,,,2500,1.911062,50.781972
2020-884750,2020-02-20,000001,Vente,208000,,,LES PRES BRIQUE,B024,62850,62775,Sanghen,62,,,627750000A0476,,,,,,,,,,,,,0,,,,,S,sols,,,985,1.911245,50.78153
2020-884750,2020-02-20,000001,Vente,208000,,,LES PRES BRIQUE,B024,62850,62775,Sanghen,62,,,627750000A0478,,,,,,,,,,,,,0,,,,,AG,terrains d'agrément,,,317,1.911237,50.781656
2020-885041,2020-04-28,000001,Vente,7600,,,LA PLACETTE A BAUDET,B023,62850,62775,Sanghen,62,,,627750000A0336,,,,,,,,,,,,,0,,,,,T,terres,,,6330,1.898222,50.781058
2020-885096,2020-04-30,000001,Vente,18760,,,LA PLACETTE A BAUDET,B023,62850,62775,Sanghen,62,,,627750000A0335,,,,,,,,,,,,,0,,,,,T,terres,,,8255,1.899415,50.780882
2020-885096,2020-04-30,000001,Vente,18760,,,LE HU,B017,62850,62775,Sanghen,62,,,627750000B0418,,,,,,,,,,,,,0,,,,,T,terres,,,5250,1.877038,50.764287
2020-885096,2020-04-30,000001,Vente,18760,,,LE HU,B017,62850,62775,Sanghen,62,,,627750000B0432,,,,,,,,,,,,,0,,,,,T,terres,,,3240,1.880136,50.765222
2020-885876,2020-06-18,000001,Vente,18735,,,LA PLACETTE A BAUDET,B023,62850,62775,Sanghen,62,,,627750000A0339,,,,,,,,,,,,,0,,,,,T,terres,,,12490,1.895606,50.781052
2020-886148,2020-07-07,000001,Vente,14990.4,,,LE RIEZ JEAN GOT,B026,62850,62775,Sanghen,62,,,627750000B0066,,,,,,,,,,,,,0,,,,,P,prés,,,13880,1.895512,50.775969
2020-886529,2020-08-24,000001,Vente,16000,,,ECLEMY,B013,62850,62775,Sanghen,62,,,627750000A0298,,,,,,,,,,,,,0,,,,,P,prés,,,12860,1.901261,50.785784
2020-886529,2020-08-24,000001,Vente,16000,,,ECLEMY,B013,62850,62775,Sanghen,62,,,627750000A0301,,,,,,,,,,,,,0,,,,,P,prés,,,5290,1.900999,50.785315
2020-886529,2020-08-24,000001,Vente,16000,,,ECLEMY,B013,62850,62775,Sanghen,62,,,627750000A0304,,,,,,,,,,,,,0,,,,,P,prés,,,8100,1.900544,50.784725
2020-886851,2020-09-04,000001,Vente,5340,,,LES LONGUES PIECES,B019,62850,62775,Sanghen,62,,,627750000B0371,,,,,,,,,,,,,0,,,,,T,terres,,,8900,1.878739,50.768361
2020-887021,2020-09-19,000001,Vente,20000,,,LA FERME DE LA CRX,B015,62850,62775,Sanghen,62,,,627750000A0355,,,,,,,,,,,,,0,,,,,E,eaux,VIVIE,Vivier,3570,1.909352,50.777892
2020-887157,2020-09-28,000001,Vente,21300,,,LE VILLAGE,B030,62850,62775,Sanghen,62,,,627750000B0583,,,,,,,,,,,,,0,,,,,AG,terrains d'agrément,,,696,1.897208,50.775209
2020-887157,2020-09-28,000001,Vente,21300,,,LE VILLAGE,B030,62850,62775,Sanghen,62,,,627750000B0591,,,,,,,,,,,,,0,,,,,S,sols,,,345,1.897432,50.775456
2020-887912,2020-11-13,000001,Vente,97600,,,LE HU,B017,62850,62775,Sanghen,62,,,627750000B0441,,,,,,,,,,,,,0,,,,,BT,taillis simples,,,39035,1.88099,50.764206
2020-888763,2020-12-18,000002,Vente,17044.5,,,LA COTE DU COPIN,B008,62850,62775,Sanghen,62,,,627750000B0023,,,,,,,,,,,,,0,,,,,P,prés,,,9480,1.880369,50.771546
2020-888769,2020-12-21,000001,Vente,21500,5050,A,LA VAL ST BERTIN,B029,62850,62775,Sanghen,62,,,627750000B0515,,,,,,,,,,,,,0,3,Dépendance,,0,P,prés,,,836,1.879858,50.761117
2020-888769,2020-12-21,000001,Vente,21500,5050,A,LA VAL ST BERTIN,B029,62850,62775,Sanghen,62,,,627750000B0515,,,,,,,,,,,,,0,3,Dépendance,,0,J,jardins,CRESS,Cressonnière,760,1.879858,50.761117
2020-888769,2020-12-21,000001,Vente,21500,5050,A,LA VAL ST BERTIN,B029,62850,62775,Sanghen,62,,,627750000B0515,,,,,,,,,,,,,0,3,Dépendance,,0,S,sols,,,144,1.879858,50.761117
2020-888771,2020-12-21,000002,Vente,100,,,LE GRAND PRE,B016,62850,62775,Sanghen,62,,,627750000A0484,,,,,,,,,,,,,0,,,,,BT,taillis simples,,,165,1.918305,50.7827
2020-888811,2020-12-28,000001,Vente,13062.5,,,LA COTE DU COPIN,B008,62850,62775,Sanghen,62,,,627750000B0018,,,,,,,,,,,,,0,,,,,P,prés,,,12626,1.884355,50.772746
2020-888811,2020-12-28,000001,Vente,13062.5,,,LA COTE DU COPIN,B008,62850,62775,Sanghen,62,,,627750000B0018,,,,,,,,,,,,,0,,,,,T,terres,,,11124,1.884355,50.772746
2020-888817,2020-12-22,000001,Vente,27247,,,LE COPIN,B007,62850,62775,Sanghen,62,,,627750000B0362,,,,,,,,,,,,,0,,,,,T,terres,,,49540,1.8728,50.767909
