id_mutation,date_mutation,numero_disposition,nature_mutation,valeur_fonciere,adresse_numero,adresse_suffixe,adresse_nom_voie,adresse_code_voie,code_postal,code_commune,nom_commune,code_departement,ancien_code_commune,ancien_nom_commune,id_parcelle,ancien_id_parcelle,numero_volume,lot1_numero,lot1_surface_carrez,lot2_numero,lot2_surface_carrez,lot3_numero,lot3_surface_carrez,lot4_numero,lot4_surface_carrez,lot5_numero,lot5_surface_carrez,nombre_lots,code_type_local,type_local,surface_reelle_bati,nombre_pieces_principales,code_nature_culture,nature_culture,code_nature_culture_speciale,nature_culture_speciale,surface_terrain,longitude,latitude
2020-869211,2020-01-15,000001,Vente,29878.2,,,LE GRAINVAL,B028,62217,62869,Wailly,62,,,62869000ZD0105,,,,,,,,,,,,,0,,,,,T,terres,,,19804,,
2020-869211,2020-01-15,000001,Vente,29878.2,,,LE CHEMIN DE SAINT POL,B020,62217,62869,Wailly,62,,,62869000ZD0144,,,,,,,,,,,,,0,,,,,T,terres,,,1905,,
2020-869211,2020-01-15,000001,Vente,29878.2,,,LE CHEMIN DE SAINT POL,B020,62217,62869,Wailly,62,,,62869000ZD0144,,,,,,,,,,,,,0,,,,,T,terres,,,1905,,
2020-869551,2020-01-31,000001,Vente,20000,,,RUE D ARRAS,0040,62217,62869,Wailly,62,,,62869000AE0348,,,,,,,,,,,,,0,,,,,S,sols,,,40,2.727205,50.24869
2020-869551,2020-01-31,000001,Vente,20000,,,RUE D ARRAS,0040,62217,62869,Wailly,62,,,62869000AE0357,,,,,,,,,,,,,0,,,,,S,sols,,,26,2.727054,50.248809
2020-869551,2020-01-31,000001,Vente,20000,,,RUE D ARRAS,0040,62217,62869,Wailly,62,,,62869000AE0362,,,,,,,,,,,,,0,,,,,S,sols,,,166,2.727124,50.24871
2020-869603,2020-02-12,000001,Vente,600,,,RUE D ARRAS,0040,62217,62869,Wailly,62,,,62869000AE0363,,,,,,,,,,,,,0,,,,,S,sols,,,48,2.726455,50.24858
2020-869725,2020-02-24,000001,Vente,1396,,,LE VILLAGE OUEST,B040,62217,62869,Wailly,62,,,62869000AD0151,,,,,,,,,,,,,0,,,,,J,jardins,,,349,2.720785,50.2456
2020-870006,2020-03-05,000003,Echange,95887,,,LES OREILLOUX EST,B033,62217,62869,Wailly,62,,,62869000ZK0048,,,,,,,,,,,,,0,,,,,T,terres,,,4584,,
2020-871538,2020-07-10,000001,Vente,216000,1,,RUE D ARRAS,0040,62217,62869,Wailly,62,,,62869000AE0119,,,,,,,,,,,,,0,1,Maison,105,4,S,sols,,,169,2.725098,50.247872
2020-871964,2020-07-24,000001,Vente,135000,1,,RUE DE L EGLISE,0100,62217,62869,Wailly,62,,,62869000AD0110,,,,,,,,,,,,,0,1,Maison,96,3,S,sols,,,671,2.724282,50.247206
2020-872002,2020-08-21,000001,Vente,13568.5,,,CHEM DE DAINVILLE,B042,62217,62869,Wailly,62,,,62869000ZH0025,,,,,,,,,,,,,0,,,,,T,terres,,,22556,,
2020-872002,2020-08-21,000001,Vente,13568.5,,,CHEM DE DAINVILLE,B042,62217,62869,Wailly,62,,,62869000ZH0164,,,,,,,,,,,,,0,,,,,T,terres,,,2114,,
2020-872094,2020-08-24,000001,Vente,231000,5,,RUE DES ALLIES,0016,62217,62869,Wailly,62,,,62869000AC0168,,,,,,,,,,,,,0,1,Maison,93,4,J,jardins,,,894,2.721685,50.24837
2020-872094,2020-08-24,000001,Vente,231000,5,,RUE DES ALLIES,0016,62217,62869,Wailly,62,,,62869000AC0168,,,,,,,,,,,,,0,1,Maison,93,4,S,sols,,,483,2.721685,50.24837
2020-872287,2020-09-08,000001,Vente,333500,89,,RUE D ARRAS,0040,62217,62869,Wailly,62,,,62869000ZB0182,,,,,,,,,,,,,0,1,Maison,118,5,S,sols,,,1047,2.732907,50.252634
2020-872328,2020-09-12,000001,Vente,187000,,,LE VILLAGE EST,B039,62217,62869,Wailly,62,,,62869000AE0236,,,,,,,,,,,,,0,,,,,J,jardins,,,159,2.730386,50.249208
2020-872328,2020-09-12,000001,Vente,187000,,,LE VILLAGE EST,B039,62217,62869,Wailly,62,,,62869000AE0236,,,,,,,,,,,,,0,,,,,S,sols,,,16,2.730386,50.249208
2020-872328,2020-09-12,000001,Vente,187000,,,LE VILLAGE EST,B039,62217,62869,Wailly,62,,,62869000AE0237,,,,,,,,,,,,,0,,,,,T,terres,,,169,2.730294,50.249209
2020-872328,2020-09-12,000001,Vente,187000,,,LE VILLAGE EST,B039,62217,62869,Wailly,62,,,62869000AE0238,,,,,,,,,,,,,0,,,,,T,terres,,,192,2.730334,50.249112
2020-872328,2020-09-12,000001,Vente,187000,42,,RUE D ARRAS,0040,62217,62869,Wailly,62,,,62869000AE0255,,,,,,,,,,,,,0,1,Maison,89,4,S,sols,,,285,2.729974,50.249386
2020-872328,2020-09-12,000001,Vente,187000,,,RUE D ARRAS,0040,62217,62869,Wailly,62,,,62869000AE0256,,,,,,,,,,,,,0,,,,,S,sols,,,301,2.73,50.24947
2020-872328,2020-09-12,000001,Vente,187000,,,LE VILLAGE EST,B039,62217,62869,Wailly,62,,,62869000AE0306,,,,,,,,,,,,,0,,,,,T,terres,,,209,2.73061,50.248963
2020-872416,2020-09-18,000001,Vente,180000,,,LES OREILLOUX NORD,B034,62217,62869,Wailly,62,,,62869000AI0009,,,,,,,,,,,,,0,,,,,T,terres,,,246,2.730737,50.249648
2020-872416,2020-09-18,000001,Vente,180000,,,LES OREILLOUX NORD,B034,62217,62869,Wailly,62,,,62869000AI0010,,,,,,,,,,,,,0,,,,,T,terres,,,526,2.730585,50.249786
2020-872416,2020-09-18,000001,Vente,180000,46,,RUE D ARRAS,0040,62217,62869,Wailly,62,,,62869000AI0011,,,,,,,,,,,,,0,1,Maison,83,5,S,sols,,,270,2.730685,50.249829
2020-872416,2020-09-18,000001,Vente,180000,46,,RUE D ARRAS,0040,62217,62869,Wailly,62,,,62869000AI0011,,,,,,,,,,,,,0,1,Maison,83,5,J,jardins,,,833,2.730685,50.249829
2020-872478,2020-09-18,000002,Vente,300,,,LE VILLAGE EST,B039,62217,62869,Wailly,62,,,62869000AE0365,,,,,,,,,,,,,0,,,,,J,jardins,,,39,2.726349,50.248741
2020-873165,2020-10-19,000001,Vente,135000,35,,RUE DE PAS,0280,62217,62869,Wailly,62,,,62869000AD0299,,,,,,,,,,,,,0,1,Maison,83,4,S,sols,,,553,2.719141,50.243449
2020-874321,2020-12-15,000002,Vente,212200,25,,RUE DU FAUBOURG DES ALOUETTES,0120,62217,62869,Wailly,62,,,62869000AH0295,,,,,,,,,,,,,0,1,Maison,106,6,,,,,,,
2020-874556,2020-12-22,000001,Vente,1850,,,LE VILLAGE EST,B039,62217,62869,Wailly,62,,,62869000AE0109,,,,,,,,,,,,,0,,,,,J,jardins,,,316,2.724282,50.248226
