id_mutation,date_mutation,numero_disposition,nature_mutation,valeur_fonciere,adresse_numero,adresse_suffixe,adresse_nom_voie,adresse_code_voie,code_postal,code_commune,nom_commune,code_departement,ancien_code_commune,ancien_nom_commune,id_parcelle,ancien_id_parcelle,numero_volume,lot1_numero,lot1_surface_carrez,lot2_numero,lot2_surface_carrez,lot3_numero,lot3_surface_carrez,lot4_numero,lot4_surface_carrez,lot5_numero,lot5_surface_carrez,nombre_lots,code_type_local,type_local,surface_reelle_bati,nombre_pieces_principales,code_nature_culture,nature_culture,code_nature_culture_speciale,nature_culture_speciale,surface_terrain,longitude,latitude
2020-904701,2020-02-10,000001,Vente,50000,5061,,LA CHAUX,B033,63390,63100,Châteauneuf-les-Bains,63,,,631000000B0479,,,,,,,,,,,,,0,1,Maison,60,3,T,terres,,,340,2.897671,46.028863
2020-904701,2020-02-10,000001,Vente,50000,5061,,LA CHAUX,B033,63390,63100,Châteauneuf-les-Bains,63,,,631000000B0479,,,,,,,,,,,,,0,1,Maison,60,3,S,sols,,,380,2.897671,46.028863
2020-904701,2020-02-10,000001,Vente,50000,,,LA CHAUX,B033,63390,63100,Châteauneuf-les-Bains,63,,,631000000B1266,,,,,,,,,,,,,0,,,,,P,prés,,,1080,2.897611,46.028706
2020-904701,2020-02-10,000001,Vente,50000,,,LA CHAUX,B033,63390,63100,Châteauneuf-les-Bains,63,,,631000000B1267,,,,,,,,,,,,,0,,,,,S,sols,,,204,2.897657,46.0288
2020-904701,2020-02-10,000001,Vente,50000,,,LA CHAUX,B033,63390,63100,Châteauneuf-les-Bains,63,,,631000000B1267,,,,,,,,,,,,,0,,,,,P,prés,,,166,2.897657,46.0288
2020-905062,2020-05-07,000001,Vente,8000,5378,,LES RABAIS,B091,63390,63100,Châteauneuf-les-Bains,63,,,631000000B1878,,,,,,,,,,,,,0,3,Dépendance,,0,S,sols,,,201,2.889003,46.034167
2020-905062,2020-05-07,000001,Vente,8000,,,LES RABAIS,B091,63390,63100,Châteauneuf-les-Bains,63,,,631000000B1881,,,,,,,,,,,,,0,,,,,S,sols,,,4,2.888924,46.034128
2020-905376,2020-06-09,000001,Vente,57700,,,LE GOT,B056,63390,63100,Châteauneuf-les-Bains,63,,,631000000C0293,,,,,,,,,,,,,0,,,,,J,jardins,,,970,2.903197,46.028569
2020-905376,2020-06-09,000001,Vente,57700,5192,,LE GOT,B056,63390,63100,Châteauneuf-les-Bains,63,,,631000000C0294,,,,,,,,,,,,,0,1,Maison,62,2,S,sols,,,180,2.903308,46.028628
2020-905705,2020-07-22,000001,Vente,49500,5037,,LES RABAIS,B091,63390,63100,Châteauneuf-les-Bains,63,,,631000000B1252,,,,,,,,,,,,,0,1,Maison,66,3,S,sols,,,1045,2.888312,46.034007
2020-905934,2020-08-13,000002,Vente,27000,,,GRANDVAL,B059,63390,63100,Châteauneuf-les-Bains,63,,,631000000B0869,,,,,,,,,,,,,0,,,,,S,sols,,,67,2.881814,46.020596
2020-905934,2020-08-13,000002,Vente,27000,,,GRANDVAL,B059,63390,63100,Châteauneuf-les-Bains,63,,,631000000B0885,,,,,,,,,,,,,0,,,,,T,terres,,,2779,2.881309,46.020657
2020-905934,2020-08-13,000002,Vente,27000,,,GRANDVAL,B059,63390,63100,Châteauneuf-les-Bains,63,,,631000000B1477,,,,,,,,,,,,,0,,,,,PA,pâtures,,,475,2.881908,46.020578
2020-905934,2020-08-13,000002,Vente,27000,5253,,GRANDVAL,B059,63390,63100,Châteauneuf-les-Bains,63,,,631000000B1792,,,,,,,,,,,,,0,1,Maison,80,3,S,sols,,,331,2.881578,46.020462
2020-905934,2020-08-13,000002,Vente,27000,,,GRANDVAL,B059,63390,63100,Châteauneuf-les-Bains,63,,,631000000B1889,,,,,,,,,,,,,0,,,,,J,jardins,,,183,2.881858,46.020457
2020-905934,2020-08-13,000002,Vente,27000,,,GRANDVAL,B059,63390,63100,Châteauneuf-les-Bains,63,,,631000000B1891,,,,,,,,,,,,,0,,,,,P,prés,,,360,2.881369,46.020434
2020-906274,2020-09-10,000001,Vente,110000,,,LES AGNES,B001,63390,63100,Châteauneuf-les-Bains,63,,,631000000C0425,,,,,,,,,,,,,0,,,,,BT,taillis simples,,,2045,2.909119,46.002448
2020-906274,2020-09-10,000001,Vente,110000,,,LES AGNES,B001,63390,63100,Châteauneuf-les-Bains,63,,,631000000C0426,,,,,,,,,,,,,0,,,,,BT,taillis simples,,,3245,2.908441,46.003137
2020-906274,2020-09-10,000001,Vente,110000,,,PUY GIBAUD,B088,63390,63100,Châteauneuf-les-Bains,63,,,631000000C0651,,,,,,,,,,,,,0,,,,,BT,taillis simples,,,5795,2.909711,45.993923
2020-906274,2020-09-10,000001,Vente,110000,,,PUY GIBAUD,B088,63390,63100,Châteauneuf-les-Bains,63,,,631000000C0849,,,,,,,,,,,,,0,,,,,BT,taillis simples,,,7258,2.911209,45.993714
2020-906302,2020-09-11,000001,Vente,71250,,,LE GOT,B056,63390,63100,Châteauneuf-les-Bains,63,,,631000000C0313,,,,,,,,,,,,,0,,,,,J,jardins,,,730,2.904001,46.029212
2020-906302,2020-09-11,000001,Vente,71250,5201,,LE GOT,B056,63390,63100,Châteauneuf-les-Bains,63,,,631000000C0314,,,,,,,,,,,,,0,1,Maison,104,5,S,sols,,,320,2.903756,46.028974
2020-906302,2020-09-11,000001,Vente,71250,,,LE GOT,B056,63390,63100,Châteauneuf-les-Bains,63,,,631000000C0667,,,,,,,,,,,,,0,,,,,L,landes,,,1500,2.904408,46.029575
2020-906312,2020-10-02,000001,Vente,800,,,LE GOT,B056,63390,63100,Châteauneuf-les-Bains,63,,,631000000C0338,,,,,,,,,,,,,0,,,,,L,landes,,,2980,2.904206,46.026614
2020-906312,2020-10-02,000001,Vente,800,,,LE GOT,B056,63390,63100,Châteauneuf-les-Bains,63,,,631000000C0339,,,,,,,,,,,,,0,,,,,T,terres,,,4685,2.903917,46.026833
2020-906409,2020-09-22,000001,Vente,229750,,,LES VIETES,B115,63390,63100,Châteauneuf-les-Bains,63,,,631000000C0187,,,,,,,,,,,,,0,,,,,T,terres,,,3080,2.901424,46.02048
2020-906409,2020-09-22,000001,Vente,229750,,,LES VIETES,B115,63390,63100,Châteauneuf-les-Bains,63,,,631000000C0814,,,,,,,,,,,,,0,,,,,L,landes,,,7598,2.902021,46.020144
2020-906409,2020-09-22,000001,Vente,229750,,,GOBIAT,B055,63390,63100,Châteauneuf-les-Bains,63,,,631000000C0962,,,,,,,,,,,,,0,,,,,T,terres,,,1745,2.900242,46.020245
2020-906409,2020-09-22,000001,Vente,229750,,,GOBIAT,B055,63390,63100,Châteauneuf-les-Bains,63,,,631000000C0962,,,,,,,,,,,,,0,,,,,AB,terrains a bâtir,,,2500,2.900242,46.020245
2020-906409,2020-09-22,000001,Vente,229750,5406,,GOBIAT,B055,63390,63100,Châteauneuf-les-Bains,63,,,631000000C0963,,,,,,,,,,,,,0,1,Maison,159,5,P,prés,,,4394,2.900588,46.019703
2020-906409,2020-09-22,000001,Vente,229750,5406,,GOBIAT,B055,63390,63100,Châteauneuf-les-Bains,63,,,631000000C0963,,,,,,,,,,,,,0,1,Maison,159,5,S,sols,,,500,2.900588,46.019703
2020-906412,2020-09-29,000002,Vente,150,,,GRANDVAL,B059,63390,63100,Châteauneuf-les-Bains,63,,,631000000B1892,,,,,,,,,,,,,0,,,,,P,prés,,,200,2.881622,46.020095
2020-906702,2020-10-29,000001,Vente,13000,5422,,LES RABAIS,B091,63390,63100,Châteauneuf-les-Bains,63,,,631000000B1879,,,,,,,,,,,,,0,3,Dépendance,,0,S,sols,,,116,2.888846,46.034226
2020-906702,2020-10-29,000001,Vente,13000,,,LES RABAIS,B091,63390,63100,Châteauneuf-les-Bains,63,,,631000000B1880,,,,,,,,,,,,,0,,,,,S,sols,,,116,2.888824,46.034184
2020-907188,2020-12-09,000002,Vente,3500,,,LES ROCHES,B097,63390,63100,Châteauneuf-les-Bains,63,,,631000000D0562,,,,,,,,,,,,,0,,,,,S,sols,,,212,2.89449,46.017833
2020-907308,2020-12-22,000001,Vente,47100,,,LA CHAUX,B033,63390,63100,Châteauneuf-les-Bains,63,,,631000000B0516,,,,,,,,,,,,,0,,,,,P,prés,,,510,2.900593,46.029095
2020-907308,2020-12-22,000001,Vente,47100,5091,,LA CHAUX,B033,63390,63100,Châteauneuf-les-Bains,63,,,631000000B1425,,,,,,,,,,,,,0,1,Maison,49,3,S,sols,,,400,2.900356,46.029158
2020-907308,2020-12-22,000001,Vente,47100,5091,,LA CHAUX,B033,63390,63100,Châteauneuf-les-Bains,63,,,631000000B1425,,,,,,,,,,,,,0,1,Maison,49,3,J,jardins,,,300,2.900356,46.029158
