id_mutation,date_mutation,numero_disposition,nature_mutation,valeur_fonciere,adresse_numero,adresse_suffixe,adresse_nom_voie,adresse_code_voie,code_postal,code_commune,nom_commune,code_departement,ancien_code_commune,ancien_nom_commune,id_parcelle,ancien_id_parcelle,numero_volume,lot1_numero,lot1_surface_carrez,lot2_numero,lot2_surface_carrez,lot3_numero,lot3_surface_carrez,lot4_numero,lot4_surface_carrez,lot5_numero,lot5_surface_carrez,nombre_lots,code_type_local,type_local,surface_reelle_bati,nombre_pieces_principales,code_nature_culture,nature_culture,code_nature_culture_speciale,nature_culture_speciale,surface_terrain,longitude,latitude
2020-896039,2020-01-17,000001,Vente,1500,,,LE BOUCHET,B011,63520,63155,Estandeuil,63,,,631550000A0593,,,,,,,,,,,,,0,,,,,T,terres,,,3210,3.457056,45.691256
2020-896039,2020-01-17,000001,Vente,1500,,,LE BOUCHET,B011,63520,63155,Estandeuil,63,,,631550000A0593,,,,,,,,,,,,,0,,,,,T,terres,,,3210,3.457056,45.691256
2020-896203,2020-01-24,000001,Vente,40000,,,LES COTES ET LES PLAINES,B048,63520,63155,Estandeuil,63,,,631550000D0767,,,,,,,,,,,,,0,,,,,P,prés,,,643,3.435857,45.69556
2020-896203,2020-01-24,000001,Vente,40000,,,LES COTES ET LES PLAINES,B048,63520,63155,Estandeuil,63,,,631550000D0770,,,,,,,,,,,,,0,,,,,P,prés,,,1875,3.435806,45.695746
2020-897166,2020-02-24,000001,Vente,59000,,,LE BRUCHEIX,B014,63520,63155,Estandeuil,63,,,631550000B0206,,,,,,,,,,,,,0,,,,,P,prés,,,4790,3.444942,45.677377
2020-897166,2020-02-24,000001,Vente,59000,5088,,LA CROIX,B052,63520,63155,Estandeuil,63,,,631550000B0743,,,,,,,,,,,,,0,1,Maison,100,2,S,sols,,,910,3.444129,45.677518
2020-897802,2020-04-17,000001,Vente,50000,,,LE PIALOUX,B100,63520,63155,Estandeuil,63,,,631550000D0754,,,,,,,,,,,,,0,,,,,T,terres,,,153,3.437904,45.698633
2020-897802,2020-04-17,000001,Vente,50000,,,LE PIALOUX,B100,63520,63155,Estandeuil,63,,,631550000D0756,,,,,,,,,,,,,0,,,,,S,sols,,,15,3.437675,45.698315
2020-897802,2020-04-17,000001,Vente,50000,,,LE PIALOUX,B100,63520,63155,Estandeuil,63,,,631550000D0757,,,,,,,,,,,,,0,,,,,S,sols,,,541,3.438097,45.698589
2020-897802,2020-04-17,000001,Vente,50000,,,LE PIALOUX,B100,63520,63155,Estandeuil,63,,,631550000D0757,,,,,,,,,,,,,0,,,,,P,prés,,,1300,3.438097,45.698589
2020-898300,2020-05-19,000001,Vente,25000,,,LA BARRIERE,B002,63520,63155,Estandeuil,63,,,631550000D0782,,,,,,,,,,,,,0,,,,,AB,terrains a bâtir,,,1705,3.449599,45.688734
2020-898300,2020-05-19,000001,Vente,25000,,,LA BARRIERE,B002,63520,63155,Estandeuil,63,,,631550000D0787,,,,,,,,,,,,,0,,,,,AB,terrains a bâtir,,,45,3.449306,45.6891
2020-898560,2020-06-08,000001,Vente,163825,5060,,LE BOUCHET,B011,63520,63155,Estandeuil,63,,,631550000A0603,,,,,,,,,,,,,0,1,Maison,77,4,P,prés,,,1500,3.456354,45.689357
2020-898560,2020-06-08,000001,Vente,163825,5060,,LE BOUCHET,B011,63520,63155,Estandeuil,63,,,631550000A0603,,,,,,,,,,,,,0,1,Maison,77,4,AG,terrains d'agrément,,,1000,3.456354,45.689357
2020-898560,2020-06-08,000001,Vente,163825,5060,,LE BOUCHET,B011,63520,63155,Estandeuil,63,,,631550000A0603,,,,,,,,,,,,,0,1,Maison,77,4,S,sols,,,770,3.456354,45.689357
2020-898588,2020-05-29,000001,Vente,2000,,,PUISSOCHET,B117,63520,63155,Estandeuil,63,,,631550000A0299,,,,,,,,,,,,,0,,,,,S,sols,,,35,3.454535,45.685302
2020-898843,2020-06-12,000001,Vente,39000,,,COTE DE LAVE,B045,63520,63155,Estandeuil,63,,,631550000D0772,,,,,,,,,,,,,0,,,,,AB,terrains a bâtir,,,1855,3.448539,45.688852
2020-898843,2020-06-12,000001,Vente,39000,,,COTE DE LAVE,B045,63520,63155,Estandeuil,63,,,631550000D0778,,,,,,,,,,,,,0,,,,,S,sols,,,23,3.449063,45.689027
2020-899267,2020-06-11,000001,Vente,27000,,,LA BARRIERE,B002,63520,63155,Estandeuil,63,,,631550000D0783,,,,,,,,,,,,,0,,,,,AB,terrains a bâtir,,,1375,3.449519,45.688706
2020-899267,2020-06-11,000001,Vente,27000,,,LA BARRIERE,B002,63520,63155,Estandeuil,63,,,631550000D0786,,,,,,,,,,,,,0,,,,,AB,terrains a bâtir,,,113,3.4493,45.689067
2020-899920,2020-07-08,000001,Vente,1100,,,LE CHAMP DES ORMEAUX,B023,63520,63155,Estandeuil,63,,,631550000C0341,,,,,,,,,,,,,0,,,,,T,terres,,,5200,3.432682,45.673607
2020-899920,2020-07-08,000001,Vente,1100,,,LE CHAMP DES ORMEAUX,B023,63520,63155,Estandeuil,63,,,631550000C0342,,,,,,,,,,,,,0,,,,,PA,pâtures,,,2800,3.43323,45.672649
2020-899947,2020-07-22,000002,Vente,35000,,,LES COTES ET LES PLAINES,B048,63520,63155,Estandeuil,63,,,631550000D0796,,,,,,,,,,,,,0,,,,,P,prés,,,1450,3.43597,45.695338
2020-900204,2020-08-10,000001,Vente,25000,,,LES SOLS,B137,63520,63155,Estandeuil,63,,,631550000B0715,,,,,,,,,,,,,0,,,,,BT,taillis simples,,,2590,3.450021,45.686134
2020-900204,2020-08-10,000001,Vente,25000,,,LES SOLS,B137,63520,63155,Estandeuil,63,,,631550000B0715,,,,,,,,,,,,,0,,,,,PA,pâtures,,,2641,3.450021,45.686134
2020-900204,2020-08-10,000001,Vente,25000,,,LES SOLS,B137,63520,63155,Estandeuil,63,,,631550000B0717,,,,,,,,,,,,,0,,,,,T,terres,,,792,3.449632,45.686695
2020-900581,2020-07-20,000001,Vente,73000,5213,,LE PIALOUX,B100,63520,63155,Estandeuil,63,,,631550000D0794,,,,,,,,,,,,,0,1,Maison,85,4,S,sols,,,391,3.437593,45.698399
2020-900581,2020-07-20,000001,Vente,73000,5213,,LE PIALOUX,B100,63520,63155,Estandeuil,63,,,631550000D0794,,,,,,,,,,,,,0,1,Maison,85,4,T,terres,,,287,3.437593,45.698399
2020-900581,2020-07-20,000001,Vente,73000,5213,,LE PIALOUX,B100,63520,63155,Estandeuil,63,,,631550000D0794,,,,,,,,,,,,,0,1,Maison,85,4,P,prés,,,1918,3.437593,45.698399
2020-900626,2020-08-28,000001,Vente,140000,5211,,BOUREL,B012,63520,63155,Estandeuil,63,,,631550000C0015,,,,,,,,,,,,,0,1,Maison,80,2,S,sols,,,110,3.431454,45.683172
2020-900626,2020-08-28,000001,Vente,140000,,,BOUREL,B012,63520,63155,Estandeuil,63,,,631550000C0016,,,,,,,,,,,,,0,,,,,S,sols,,,193,3.431636,45.683403
2020-900626,2020-08-28,000001,Vente,140000,,,LE VERGER,B150,63520,63155,Estandeuil,63,,,631550000C0077,,,,,,,,,,,,,0,,,,,P,prés,,,3195,3.43186,45.683275
2020-901612,2020-10-08,000001,Vente,135000,5331,,LES LOYES,B084,63520,63155,Estandeuil,63,,,631550000B0753,,,,,,,,,,,,,0,1,Maison,110,3,S,sols,,,813,3.452742,45.689719
2020-902656,2020-10-28,000001,Vente,315000,,,LES CHARBONNIERES,B029,63520,63155,Estandeuil,63,,,631550000B0429,,,,,,,,,,,,,0,,,,,BR,futaies résineuses,,,3800,3.456169,45.671992
2020-902656,2020-10-28,000001,Vente,315000,,,LES CHARBONNIERES,B029,63520,63155,Estandeuil,63,,,631550000B0430,,,,,,,,,,,,,0,,,,,P,prés,,,5940,3.457165,45.671593
2020-903522,2020-11-30,000001,Vente,163395,,,LA CROIX,B052,63520,63155,Estandeuil,63,,,631550000C0251,,,,,,,,,,,,,0,,,,,P,prés,,,1520,3.441047,45.679053
2020-903522,2020-11-30,000001,Vente,163395,,,LA CROIX,B052,63520,63155,Estandeuil,63,,,631550000C0973,,,,,,,,,,,,,0,,,,,P,prés,,,1159,3.440609,45.678537
2020-903522,2020-11-30,000001,Vente,163395,,,LA CROIX,B052,63520,63155,Estandeuil,63,,,631550000C0973,,,,,,,,,,,,,0,,,,,P,prés,,,1159,3.440609,45.678537
2020-903522,2020-11-30,000001,Vente,163395,,,LA CROIX,B052,63520,63155,Estandeuil,63,,,631550000C0976,,,,,,,,,,,,,0,,,,,P,prés,,,1246,3.440502,45.67751
2020-903522,2020-11-30,000001,Vente,163395,,,L ETANG,B060,63520,63155,Estandeuil,63,,,631550000C0980,,,,,,,,,,,,,0,,,,,P,prés,,,75,3.440472,45.677072
2020-903522,2020-11-30,000001,Vente,163395,,,L ETANG,B060,63520,63155,Estandeuil,63,,,631550000C0981,,,,,,,,,,,,,0,,,,,P,prés,,,85,3.440448,45.677003
2020-903522,2020-11-30,000001,Vente,163395,,,LA CROIX,B052,63520,63155,Estandeuil,63,,,631550000C0992,,,,,,,,,,,,,0,,,,,P,prés,,,207,3.441891,45.67912
2020-903522,2020-11-30,000001,Vente,163395,,,LA CROIX,B052,63520,63155,Estandeuil,63,,,631550000C0993,,,,,,,,,,,,,0,,,,,P,prés,,,1244,3.441134,45.678739
2020-903522,2020-11-30,000001,Vente,163395,5021,,BOURG D ESTANDEUIL,B059,63520,63155,Estandeuil,63,,,631550000C1001,,,,,,,,,,,,,0,1,Maison,125,5,S,sols,,,246,3.44178,45.679589
2020-903522,2020-11-30,000001,Vente,163395,,,BOURG D ESTANDEUIL,B059,63520,63155,Estandeuil,63,,,631550000C1002,,,,,,,,,,,,,0,,,,,J,jardins,,,42,3.441937,45.679597
2020-903522,2020-11-30,000001,Vente,163395,,,BOURG D ESTANDEUIL,B059,63520,63155,Estandeuil,63,,,631550000C1008,,,,,,,,,,,,,0,,,,,S,sols,,,113,3.441595,45.679524
2020-903522,2020-11-30,000001,Vente,163395,,,LA CROIX,B052,63520,63155,Estandeuil,63,,,631550000C1182,,,,,,,,,,,,,0,,,,,P,prés,,,1267,3.441493,45.679288
2020-903522,2020-11-30,000001,Vente,163395,,,LA CROIX,B052,63520,63155,Estandeuil,63,,,631550000C1183,,,,,,,,,,,,,0,,,,,P,prés,,,913,3.441601,45.679125
2020-903711,2020-12-21,000001,Vente,300,,,LE CLOVELOUX,B037,63520,63155,Estandeuil,63,,,631550000A0895,,,,,,,,,,,,,0,,,,,P,prés,,,228,3.45856,45.687472
2020-903711,2020-12-21,000001,Vente,300,,,LE CLOVELOUX,B037,63520,63155,Estandeuil,63,,,631550000A0897,,,,,,,,,,,,,0,,,,,P,prés,,,384,3.459501,45.687195
2020-904044,2020-12-29,000001,Vente,30000,,,LES SOLS,B137,63520,63155,Estandeuil,63,,,631550000B0067,,,,,,,,,,,,,0,,,,,BT,taillis simples,,,1262,3.451186,45.686058
2020-904044,2020-12-29,000001,Vente,30000,,,LES SOLS,B137,63520,63155,Estandeuil,63,,,631550000B0680,,,,,,,,,,,,,0,,,,,T,terres,,,389,3.450078,45.686886
2020-904044,2020-12-29,000001,Vente,30000,,,LES SOLS,B137,63520,63155,Estandeuil,63,,,631550000B0716,,,,,,,,,,,,,0,,,,,PA,pâtures,,,3892,3.450514,45.686352
2020-904044,2020-12-29,000001,Vente,30000,,,LES SOLS,B137,63520,63155,Estandeuil,63,,,631550000B0718,,,,,,,,,,,,,0,,,,,T,terres,,,68,3.449895,45.686777
2020-904350,2020-06-10,000001,Vente,293000,5301,,LES COTES ET LES PLAINES,B048,63520,63155,Estandeuil,63,,,631550000D0714,,,,,,,,,,,,,0,1,Maison,189,4,S,sols,,,1000,3.435828,45.693027
2020-904350,2020-06-10,000001,Vente,293000,5301,,LES COTES ET LES PLAINES,B048,63520,63155,Estandeuil,63,,,631550000D0714,,,,,,,,,,,,,0,1,Maison,189,4,AG,terrains d'agrément,,,5160,3.435828,45.693027
