id_mutation,date_mutation,numero_disposition,nature_mutation,valeur_fonciere,adresse_numero,adresse_suffixe,adresse_nom_voie,adresse_code_voie,code_postal,code_commune,nom_commune,code_departement,ancien_code_commune,ancien_nom_commune,id_parcelle,ancien_id_parcelle,numero_volume,lot1_numero,lot1_surface_carrez,lot2_numero,lot2_surface_carrez,lot3_numero,lot3_surface_carrez,lot4_numero,lot4_surface_carrez,lot5_numero,lot5_surface_carrez,nombre_lots,code_type_local,type_local,surface_reelle_bati,nombre_pieces_principales,code_nature_culture,nature_culture,code_nature_culture_speciale,nature_culture_speciale,surface_terrain,longitude,latitude
2020-907400,2020-01-07,000001,Vente,20,,,GACHON,B240,63890,63314,Saint-Amant-Roche-Savine,63,,,63314000ZR0059,,,,,,,,,,,,,0,,,,,S,sols,,,20,3.59159,45.585902
2020-907515,2020-01-24,000001,Vente,55500,5340,,ROUADE,B462,63890,63314,Saint-Amant-Roche-Savine,63,,,63314000ZC0283,,,,,,,,,,,,,0,1,Maison,65,3,S,sols,,,1073,3.611609,45.583589
2020-907515,2020-01-24,000001,Vente,55500,5340,,ROUADE,B462,63890,63314,Saint-Amant-Roche-Savine,63,,,63314000ZC0283,,,,,,,,,,,,,0,1,Maison,65,3,L,landes,,,609,3.611609,45.583589
2020-907515,2020-01-24,000001,Vente,55500,,,ROUADE,B462,63890,63314,Saint-Amant-Roche-Savine,63,,,63314000ZC0286,,,,,,,,,,,,,0,,,,,PA,pâtures,,,759,3.611314,45.583817
2020-907663,2020-02-19,000001,Vente,65700,,,GACHON,B240,63890,63314,Saint-Amant-Roche-Savine,63,,,63314000ZR0070,,,,,,,,,,,,,0,,,,,L,landes,,,580,3.59243,45.585308
2020-907663,2020-02-19,000001,Vente,65700,,,GACHON,B240,63890,63314,Saint-Amant-Roche-Savine,63,,,63314000ZR0070,,,,,,,,,,,,,0,,,,,T,terres,,,200,3.59243,45.585308
2020-907663,2020-02-19,000001,Vente,65700,5008,,GACHON,B240,63890,63314,Saint-Amant-Roche-Savine,63,,,63314000ZR0072,,,,,,,,,,,,,0,1,Maison,76,3,S,sols,,,320,3.592113,45.585441
2020-907860,2020-03-20,000001,Vente,1800,,,ROUADE,B462,63890,63314,Saint-Amant-Roche-Savine,63,,,63314000ZC0155,,,,,,,,,,,,,0,,,,,BR,futaies résineuses,,,9600,3.6125,45.580811
2020-908250,2020-06-12,000001,Vente,141270,5019,,LA FORIE,B231,63890,63314,Saint-Amant-Roche-Savine,63,,,63314000ZO0289,,,,,,,,,,,,,0,1,Maison,100,4,S,sols,,,1000,3.606807,45.582859
2020-908250,2020-06-12,000001,Vente,141270,5019,,LA FORIE,B231,63890,63314,Saint-Amant-Roche-Savine,63,,,63314000ZO0289,,,,,,,,,,,,,0,1,Maison,100,4,P,prés,,,1107,3.606807,45.582859
2020-908250,2020-06-12,000001,Vente,141270,,,LA FORIE,B231,63890,63314,Saint-Amant-Roche-Savine,63,,,63314000ZO0290,,,,,,,,,,,,,0,,,,,S,sols,,,48,3.606527,45.583008
2020-908250,2020-06-12,000001,Vente,141270,,,LA FORIE,B231,63890,63314,Saint-Amant-Roche-Savine,63,,,63314000ZO0291,,,,,,,,,,,,,0,,,,,S,sols,,,12,3.60708,45.582862
2020-908297,2020-06-15,000001,Vente,40000,1,,RUE HENRI POURRAT,0053,63890,63314,Saint-Amant-Roche-Savine,63,,,63314000AM0192,,,,,,,,,,,,,0,1,Maison,144,6,S,sols,,,144,3.631695,45.575213
2020-908439,2020-07-08,000001,Vente,23000,,,BARBALICHE,B006,63890,63314,Saint-Amant-Roche-Savine,63,,,63314000ZL0028,,,,,,,,,,,,,0,,,,,T,terres,,,3400,3.604464,45.560746
2020-908439,2020-07-08,000001,Vente,23000,,,BARBALICHE,B006,63890,63314,Saint-Amant-Roche-Savine,63,,,63314000ZL0028,,,,,,,,,,,,,0,,,,,P,prés,,,1400,3.604464,45.560746
2020-908439,2020-07-08,000001,Vente,23000,,,BARBALICHE,B006,63890,63314,Saint-Amant-Roche-Savine,63,,,63314000ZL0171,,,,,,,,,,,,,0,,,,,S,sols,,,200,3.604165,45.560579
2020-908480,2020-06-30,000001,Vente,47585,,,SAGNE DU PUY,B472,63890,63314,Saint-Amant-Roche-Savine,63,,,63314000AC0012,,,,,,,,,,,,,0,,,,,BR,futaies résineuses,,,1653,3.603035,45.604163
2020-908480,2020-06-30,000001,Vente,47585,,,SAGNE DU PUY,B472,63890,63314,Saint-Amant-Roche-Savine,63,,,63314000AC0014,,,,,,,,,,,,,0,,,,,BR,futaies résineuses,,,3130,3.602574,45.603467
2020-908480,2020-06-30,000001,Vente,47585,,,LES GENETTES,B250,63890,63314,Saint-Amant-Roche-Savine,63,,,63314000ZA0004,,,,,,,,,,,,,0,,,,,BR,futaies résineuses,,,18700,3.608895,45.599721
2020-908480,2020-06-30,000001,Vente,47585,,,LA VIAT ET LES GOUTTES,B554,63890,63314,Saint-Amant-Roche-Savine,63,,,63314000ZA0112,,,,,,,,,,,,,0,,,,,BR,futaies résineuses,,,4657,3.608501,45.600259
2020-908522,2020-07-01,000001,Vente,670,,,ROUADE,B462,63890,63314,Saint-Amant-Roche-Savine,63,,,63314000ZC0154,,,,,,,,,,,,,0,,,,,BR,futaies résineuses,,,6650,3.612935,45.579966
2020-908832,2020-08-14,000001,Vente,16000,,,FLEIX,B218,63890,63314,Saint-Amant-Roche-Savine,63,,,63314000ZL0083,,,,,,,,,,,,,0,,,,,PA,pâtures,,,15000,3.611051,45.552441
2020-908848,2020-08-08,000001,Vente,600,,,LA PIERRE LONGUE,B387,63890,63314,Saint-Amant-Roche-Savine,63,,,63314000ZD0076,,,,,,,,,,,,,0,,,,,PA,pâtures,,,9300,3.638688,45.576026
2020-909191,2020-09-22,000001,Vente,10000,5138,,BARBALICHE,B006,63890,63314,Saint-Amant-Roche-Savine,63,,,63314000ZL0193,,,,,,,,,,,,,0,1,Maison,36,1,S,sols,,,130,3.604774,45.560349
2020-909201,2020-10-07,000001,Vente,57200,5032,,LA FARGE,B207,63890,63314,Saint-Amant-Roche-Savine,63,,,63314000ZB0029,,,,,,,,,,,,,0,1,Maison,70,2,S,sols,,,640,3.625858,45.589031
2020-909201,2020-10-07,000001,Vente,57200,5032,,LA FARGE,B207,63890,63314,Saint-Amant-Roche-Savine,63,,,63314000ZB0029,,,,,,,,,,,,,0,1,Maison,70,2,P,prés,,,8360,3.625858,45.589031
2020-909388,2020-10-13,000002,Vente,8950,,,GUILLET,B285,63890,63314,Saint-Amant-Roche-Savine,63,,,63314000ZN0003,,,,,,,,,,,,,0,,,,,PA,pâtures,,,5400,3.59825,45.579641
2020-909388,2020-10-13,000002,Vente,8950,,,GUILLET,B285,63890,63314,Saint-Amant-Roche-Savine,63,,,63314000ZN0005,,,,,,,,,,,,,0,,,,,P,prés,,,2800,3.599125,45.579429
2020-909388,2020-10-13,000002,Vente,8950,,,LE PIROUX,B394,63890,63314,Saint-Amant-Roche-Savine,63,,,63314000ZN0031,,,,,,,,,,,,,0,,,,,BR,futaies résineuses,,,1800,3.608213,45.577727
2020-909388,2020-10-13,000002,Vente,8950,,,LE PIROUX,B394,63890,63314,Saint-Amant-Roche-Savine,63,,,63314000ZN0031,,,,,,,,,,,,,0,,,,,T,terres,,,2150,3.608213,45.577727
2020-909388,2020-10-13,000002,Vente,8950,,,LE SOLIER,B497,63890,63314,Saint-Amant-Roche-Savine,63,,,63314000ZN0045,,,,,,,,,,,,,0,,,,,P,prés,,,2400,3.601729,45.575878
2020-909388,2020-10-13,000002,Vente,8950,,,LE SOLIER,B497,63890,63314,Saint-Amant-Roche-Savine,63,,,63314000ZN0045,,,,,,,,,,,,,0,,,,,P,prés,,,2400,3.601729,45.575878
2020-909388,2020-10-13,000002,Vente,8950,,,LE SOLIER,B497,63890,63314,Saint-Amant-Roche-Savine,63,,,63314000ZN0056,,,,,,,,,,,,,0,,,,,T,terres,,,5250,3.606537,45.577135
2020-909388,2020-10-13,000002,Vente,8950,,,LE SOLIER,B497,63890,63314,Saint-Amant-Roche-Savine,63,,,63314000ZN0064,,,,,,,,,,,,,0,,,,,P,prés,,,2800,3.597557,45.57642
2020-909388,2020-10-13,000002,Vente,8950,,,LE SOLIER,B497,63890,63314,Saint-Amant-Roche-Savine,63,,,63314000ZN0064,,,,,,,,,,,,,0,,,,,P,prés,,,2800,3.597557,45.57642
2020-909388,2020-10-13,000002,Vente,8950,,,LE SOLIER,B497,63890,63314,Saint-Amant-Roche-Savine,63,,,63314000ZN0065,,,,,,,,,,,,,0,,,,,T,terres,,,4050,3.598168,45.576409
2020-909388,2020-10-13,000002,Vente,8950,,,LE SOLIER,B497,63890,63314,Saint-Amant-Roche-Savine,63,,,63314000ZN0083,,,,,,,,,,,,,0,,,,,T,terres,,,3650,3.597445,45.57437
2020-909388,2020-10-13,000002,Vente,8950,,,LE SOLIER,B497,63890,63314,Saint-Amant-Roche-Savine,63,,,63314000ZN0083,,,,,,,,,,,,,0,,,,,P,prés,,,2800,3.597445,45.57437
2020-909388,2020-10-13,000002,Vente,8950,,,LE SOLIER,B497,63890,63314,Saint-Amant-Roche-Savine,63,,,63314000ZN0083,,,,,,,,,,,,,0,,,,,T,terres,,,3200,3.597445,45.57437
2020-909388,2020-10-13,000002,Vente,8950,,,LE SOLIER,B497,63890,63314,Saint-Amant-Roche-Savine,63,,,63314000ZN0083,,,,,,,,,,,,,0,,,,,T,terres,,,3650,3.597445,45.57437
2020-909388,2020-10-13,000002,Vente,8950,,,TERRE DE BARTHIVEL,B530,63890,63314,Saint-Amant-Roche-Savine,63,,,63314000ZO0131,,,,,,,,,,,,,0,,,,,P,prés,,,12050,3.597159,45.580273
2020-909420,2020-10-17,000002,Vente,10000,5114,,LE BETHONAS,B025,63890,63314,Saint-Amant-Roche-Savine,63,,,63314000ZB0143,,,,,,,,,,,,,0,1,Maison,78,4,,,,,,3.614172,45.589718
2020-909420,2020-10-17,000002,Vente,10000,5114,,LE BETHONAS,B025,63890,63314,Saint-Amant-Roche-Savine,63,,,63314000ZB0143,,,,,,,,,,,,,0,1,Maison,78,4,,,,,,3.614172,45.589718
2020-909492,2020-11-13,000001,Vente,1500,,,GOURLET,B252,63890,63314,Saint-Amant-Roche-Savine,63,,,63314000ZR0140,,,,,,,,,,,,,0,,,,,BR,futaies résineuses,,,5600,3.57893,45.583179
2020-909492,2020-11-13,000001,Vente,1500,,,LES CARRIERES,B073,63890,63314,Saint-Amant-Roche-Savine,63,,,63314000ZR0235,,,,,,,,,,,,,0,,,,,BR,futaies résineuses,,,921,3.580251,45.581625
2020-909829,2020-12-04,000001,Vente,20000,5464,,LE SOLIER,B497,63890,63314,Saint-Amant-Roche-Savine,63,,,63314000ZN0233,,,,,,,,,,,,,0,1,Maison,30,1,J,jardins,,,1925,3.600072,45.575242
2020-909829,2020-12-04,000001,Vente,20000,5464,,LE SOLIER,B497,63890,63314,Saint-Amant-Roche-Savine,63,,,63314000ZN0233,,,,,,,,,,,,,0,1,Maison,30,1,S,sols,,,700,3.600072,45.575242
2020-909851,2020-12-20,000001,Vente,28000,,,LE BOURG,B040,63890,63314,Saint-Amant-Roche-Savine,63,,,63314000AM0217,,,12,,,,,,,,,,1,,,,,J,jardins,,,40,3.631294,45.574777
2020-909851,2020-12-20,000001,Vente,28000,,,LE BOURG,B040,63890,63314,Saint-Amant-Roche-Savine,63,,,63314000AM0217,,,10,,,,,,,,,,1,,,,,S,sols,,,15,3.631294,45.574777
2020-909851,2020-12-20,000001,Vente,28000,4,,RUE HENRI POURRAT,0053,63890,63314,Saint-Amant-Roche-Savine,63,,,63314000AM0217,,,11,,6,,7,,8,,9,,5,1,Maison,128,3,,,,,,3.631294,45.574777
