id_mutation,date_mutation,numero_disposition,nature_mutation,valeur_fonciere,adresse_numero,adresse_suffixe,adresse_nom_voie,adresse_code_voie,code_postal,code_commune,nom_commune,code_departement,ancien_code_commune,ancien_nom_commune,id_parcelle,ancien_id_parcelle,numero_volume,lot1_numero,lot1_surface_carrez,lot2_numero,lot2_surface_carrez,lot3_numero,lot3_surface_carrez,lot4_numero,lot4_surface_carrez,lot5_numero,lot5_surface_carrez,nombre_lots,code_type_local,type_local,surface_reelle_bati,nombre_pieces_principales,code_nature_culture,nature_culture,code_nature_culture_speciale,nature_culture_speciale,surface_terrain,longitude,latitude
2020-904357,2020-12-10,000001,Echange,2500,,,SAINT MARTIN,B025,63570,63375,Saint-Martin-des-Plains,63,,,633750000C0689,,,,,,,,,,,,,0,,,,,T,terres,,,266,3.323008,45.491217
2020-910110,2020-01-28,000001,Vente,34000,,,LA FONT DE MONTEL,B007,63570,63375,Saint-Martin-des-Plains,63,,,63375000ZB0263,,,,,,,,,,,,,0,,,,,P,prés,,,800,3.320269,45.491561
2020-910794,2020-07-02,000001,Vente,1200,,,SAINT MARTIN,B025,63570,63375,Saint-Martin-des-Plains,63,,,633750000C0395,,,,,,,,,,,,,0,,,,,P,prés,,,100,3.324391,45.490633
2020-910794,2020-07-02,000001,Vente,1200,,,LE FRESSE,B008,63570,63375,Saint-Martin-des-Plains,63,,,63375000ZB0028,,,,,,,,,,,,,0,,,,,PA,pâtures,,,3970,3.311222,45.496622
2020-910794,2020-07-02,000001,Vente,1200,,,LE BAS DE LA FONT DE MONTE,B034,63570,63375,Saint-Martin-des-Plains,63,,,63375000ZC0036,,,,,,,,,,,,,0,,,,,BT,taillis simples,,,800,3.324283,45.490474
2020-911052,2020-08-20,000001,Vente,176400,,,SAINT MARTIN,B025,63570,63375,Saint-Martin-des-Plains,63,,,633750000C0332,,,,,,,,,,,,,0,,,,,S,sols,,,75,3.321367,45.489703
2020-911052,2020-08-20,000001,Vente,176400,,,SAINT MARTIN,B025,63570,63375,Saint-Martin-des-Plains,63,,,633750000C0333,,,,,,,,,,,,,0,,,,,S,sols,,,100,3.321472,45.489659
2020-911052,2020-08-20,000001,Vente,176400,2,,RUE DE LA MERANDIE,0014,63570,63375,Saint-Martin-des-Plains,63,,,633750000C0334,,,,,,,,,,,,,0,1,Maison,110,6,S,sols,,,335,3.321625,45.489581
2020-911065,2020-08-20,000001,Vente,156800,,,SAINT MARTIN,B025,63570,63375,Saint-Martin-des-Plains,63,,,633750000C0677,,,,,,,,,,,,,0,,,,,S,sols,,,45,3.323295,45.490964
2020-911065,2020-08-20,000001,Vente,156800,15,B,RUE DE LA FOND DE MONTEL,0008,63570,63375,Saint-Martin-des-Plains,63,,,63375000ZB0256,,,,,,,,,,,,,0,1,Maison,88,4,AG,terrains d'agrément,,,298,3.32371,45.490871
2020-911065,2020-08-20,000001,Vente,156800,15,B,RUE DE LA FOND DE MONTEL,0008,63570,63375,Saint-Martin-des-Plains,63,,,63375000ZB0256,,,,,,,,,,,,,0,1,Maison,88,4,S,sols,,,500,3.32371,45.490871
2020-911065,2020-08-20,000001,Vente,156800,,,LA FONT DE MONTEL,B007,63570,63375,Saint-Martin-des-Plains,63,,,63375000ZB0258,,,,,,,,,,,,,0,,,,,S,sols,,,413,3.323414,45.491092
2020-911110,2020-09-11,000001,Vente,200000,11,,RUE DE LA FOND DE MONTEL,0008,63570,63375,Saint-Martin-des-Plains,63,,,633750000C0384,,,,,,,,,,,,,0,1,Maison,143,6,S,sols,,,295,3.322598,45.491138
2020-911110,2020-09-11,000001,Vente,200000,,,SAINT MARTIN,B025,63570,63375,Saint-Martin-des-Plains,63,,,633750000C0389,,,,,,,,,,,,,0,,,,,T,terres,,,1235,,
2020-911110,2020-09-11,000001,Vente,200000,,,SAINT MARTIN,B025,63570,63375,Saint-Martin-des-Plains,63,,,633750000C0390,,,,,,,,,,,,,0,,,,,T,terres,,,1465,,
2020-911110,2020-09-11,000001,Vente,200000,,,SAINT MARTIN,B025,63570,63375,Saint-Martin-des-Plains,63,,,633750000C0391,,,,,,,,,,,,,0,,,,,T,terres,,,1165,,
2020-911547,2020-11-20,000001,Vente,103500,11,,RUE DU MICOCOULIER,0012,63570,63375,Saint-Martin-des-Plains,63,,,633750000C0292,,,,,,,,,,,,,0,1,Maison,75,3,S,sols,,,80,3.319315,45.490608
2020-911547,2020-11-20,000001,Vente,103500,,,SAINT MARTIN,B025,63570,63375,Saint-Martin-des-Plains,63,,,633750000C0599,,,,,,,,,,,,,0,,,,,S,sols,,,70,3.319341,45.490508
2020-911547,2020-11-20,000001,Vente,103500,,,SAINT MARTIN,B025,63570,63375,Saint-Martin-des-Plains,63,,,633750000C0600,,,,,,,,,,,,,0,,,,,S,sols,,,130,3.319368,45.490438
2020-911672,2020-12-11,000001,Vente,2682,,,LA ROUYE,B024,63570,63375,Saint-Martin-des-Plains,63,,,63375000ZB0031,,,,,,,,,,,,,0,,,,,PA,pâtures,,,8940,3.311596,45.496383
2020-911896,2020-02-12,000001,Vente,2250,,,USSENE,B026,63570,63375,Saint-Martin-des-Plains,63,,,63375000ZB0070,,,,,,,,,,,,,0,,,,,T,terres,,,3750,3.314582,45.499607
