id_mutation,date_mutation,numero_disposition,nature_mutation,valeur_fonciere,adresse_numero,adresse_suffixe,adresse_nom_voie,adresse_code_voie,code_postal,code_commune,nom_commune,code_departement,ancien_code_commune,ancien_nom_commune,id_parcelle,ancien_id_parcelle,numero_volume,lot1_numero,lot1_surface_carrez,lot2_numero,lot2_surface_carrez,lot3_numero,lot3_surface_carrez,lot4_numero,lot4_surface_carrez,lot5_numero,lot5_surface_carrez,nombre_lots,code_type_local,type_local,surface_reelle_bati,nombre_pieces_principales,code_nature_culture,nature_culture,code_nature_culture_speciale,nature_culture_speciale,surface_terrain,longitude,latitude
2020-904407,2020-01-03,000001,Vente,167580,5204,,FONTBONNE,B044,63440,63382,Saint-Pardoux,63,,,63382000ZR0139,,,,,,,,,,,,,0,1,Maison,129,4,S,sols,,,665,2.987808,46.062361
2020-904407,2020-01-03,000001,Vente,167580,,,FONTBONNE,B044,63440,63382,Saint-Pardoux,63,,,63382000ZR0140,,,,,,,,,,,,,0,,,,,S,sols,,,25,2.98778,46.062428
2020-904407,2020-01-03,000001,Vente,167580,,,FONTBONNE,B044,63440,63382,Saint-Pardoux,63,,,63382000ZR0141,,,,,,,,,,,,,0,,,,,T,terres,,,64,2.987612,46.062431
2020-904571,2020-01-27,000001,Vente,22000,2,,RTE DES BOIS,0008,63440,63382,Saint-Pardoux,63,,,63382000AA0055,,,,,,,,,,,,,0,3,Dépendance,,0,S,sols,,,196,3.014882,46.056883
2020-904571,2020-01-27,000001,Vente,22000,2,,RTE DES BOIS,0008,63440,63382,Saint-Pardoux,63,,,63382000AA0055,,,,,,,,,,,,,0,2,Appartement,38,1,S,sols,,,196,3.014882,46.056883
2020-904571,2020-01-27,000001,Vente,22000,2,,RTE DES BOIS,0008,63440,63382,Saint-Pardoux,63,,,63382000AA0055,,,,,,,,,,,,,0,2,Appartement,89,3,S,sols,,,196,3.014882,46.056883
2020-905097,2020-04-29,000001,Vente,5000,,,LES SUCHETS,B097,63440,63382,Saint-Pardoux,63,,,63382000ZN0046,,,,,,,,,,,,,0,,,,,T,terres,,,25260,3.020112,46.051002
2020-905453,2020-06-09,000001,Vente,86880,5289,,COTE ROUDIER,B032,63440,63382,Saint-Pardoux,63,,,63382000AB0185,,,,,,,,,,,,,0,4,Local industriel. commercial ou assimilé,344,0,S,sols,,,182,3.019626,46.05501
2020-905453,2020-06-09,000001,Vente,86880,,,COTE ROUDIER,B032,63440,63382,Saint-Pardoux,63,,,63382000AB0188,,,,,,,,,,,,,0,,,,,T,terres,,,718,3.019784,46.054945
2020-905453,2020-06-09,000001,Vente,86880,,,COTE ROUDIER,B032,63440,63382,Saint-Pardoux,63,,,63382000AB0189,,,,,,,,,,,,,0,,,,,S,sols,,,9,3.019735,46.055087
2020-905536,2020-06-09,000001,Vente,49800,,,COTE ROUDIER,B032,63440,63382,Saint-Pardoux,63,,,63382000AB0191,,,,,,,,,,,,,0,,,,,S,sols,,,223,3.019963,46.054901
2020-905536,2020-06-09,000001,Vente,49800,5012,,COTE ROUDIER,B032,63440,63382,Saint-Pardoux,63,,,63382000AB0195,,,,,,,,,,,,,0,4,Local industriel. commercial ou assimilé,298,0,S,sols,,,787,3.020297,46.055168
2020-905536,2020-06-09,000001,Vente,49800,,,COTE ROUDIER,B032,63440,63382,Saint-Pardoux,63,,,63382000AB0197,,,,,,,,,,,,,0,,,,,S,sols,,,12,3.020187,46.055309
2020-905536,2020-06-09,000001,Vente,49800,,,COTE ROUDIER,B032,63440,63382,Saint-Pardoux,63,,,63382000AB0199,,,,,,,,,,,,,0,,,,,S,sols,,,117,3.019986,46.055077
2020-905611,2020-07-08,000001,Vente,104000,47,,GR GRAND RUE,0040,63440,63382,Saint-Pardoux,63,,,63382000AA0115,,,,,,,,,,,,,0,1,Maison,74,5,S,sols,,,156,3.015703,46.056439
2020-905611,2020-07-08,000001,Vente,104000,,,LE BOURG,B091,63440,63382,Saint-Pardoux,63,,,63382000AA0116,,,,,,,,,,,,,0,,,,,S,sols,,,84,3.015623,46.056331
2020-906173,2020-09-09,000001,Vente,37500,,,CROIX TIRADE,B037,63440,63382,Saint-Pardoux,63,,,63382000AA0249,,,,,,,,,,,,,0,,,,,P,prés,,,2327,3.017399,46.054964
2020-906407,2020-09-21,000001,Vente,28000,,,LE BOURG,B091,63440,63382,Saint-Pardoux,63,,,63382000AA0366,,,,,,,,,,,,,0,,,,,T,terres,,,1905,3.01136,46.057505
2020-906869,2020-11-17,000001,Vente,160000,104,,GR GRAND RUE,0040,63440,63382,Saint-Pardoux,63,,,63382000AA0359,,,,,,,,,,,,,0,1,Maison,90,4,S,sols,,,500,3.010126,46.060684
2020-906869,2020-11-17,000001,Vente,160000,104,,GR GRAND RUE,0040,63440,63382,Saint-Pardoux,63,,,63382000AA0359,,,,,,,,,,,,,0,1,Maison,90,4,AG,terrains d'agrément,,,1905,3.010126,46.060684
2020-906919,2020-11-30,000001,Vente,59000,6,,RUE DES PLAINES,0063,63440,63382,Saint-Pardoux,63,,,63382000AA0134,,,,,,,,,,,,,0,1,Maison,70,3,J,jardins,,,574,3.01609,46.057167
2020-906919,2020-11-30,000001,Vente,59000,6,,RUE DES PLAINES,0063,63440,63382,Saint-Pardoux,63,,,63382000AA0134,,,,,,,,,,,,,0,1,Maison,70,3,S,sols,,,400,3.01609,46.057167
2020-906978,2020-11-23,000001,Vente,147600,5257,,LES PARROTS,B065,63440,63382,Saint-Pardoux,63,,,63382000ZM0004,,,,,,,,,,,,,0,1,Maison,134,4,S,sols,,,1000,,
2020-906978,2020-11-23,000001,Vente,147600,5257,,LES PARROTS,B065,63440,63382,Saint-Pardoux,63,,,63382000ZM0004,,,,,,,,,,,,,0,1,Maison,134,4,P,prés,,,8910,,
2020-907110,2020-12-10,000001,Vente,75000,8,,RTE DES BOIS,0008,63440,63382,Saint-Pardoux,63,,,63382000AA0078,,,,,,,,,,,,,0,1,Maison,83,4,S,sols,,,439,3.014172,46.056631
2020-907110,2020-12-10,000001,Vente,75000,8,,RTE DES BOIS,0008,63440,63382,Saint-Pardoux,63,,,63382000AA0078,,,,,,,,,,,,,0,3,Dépendance,,0,S,sols,,,439,3.014172,46.056631
